{"text_format":"1","workbook":"xlsx","n_sheets":3,"sheets":["資料勿動","預算表","BALANCE"],"not_rendered":{"charts":0,"images":2,"macros":1,"external_links":2,"defined_names":15,"comments":2,"pivot_tables":0},"unopened":[],"bounds":{"document_bytes":16777216,"sheet_cells":100000,"rows_first":2000,"rows_last":500,"rows_between":2000,"halvings":0,"cell_chars":16384,"cell_head_chars":4096},"cells_cut":0,"cells_raw":0,"read":"whole","date_system":"1900"}

{"sheet":"資料勿動","index":0,"n_rows":888,"n_cols":17,"rows_kept":888,"cut":false,"hidden":true,"merged":[]}
["Bill To Code","Bill To Short Name","第一組","第二組","部門名稱","區","區1","BUYING_GROUP","BUYING_GROUP-1","Sales Channel Name","Sales AR","AR Sales Channel",{"$f":"SUM(K:K)","v":1669841845}]
["TW002512001B","ONE TIME CUSTOMER",null,null,"ETC","ETC","ETC","ETC","ETC_TT","TW002512001B",{"$f":"VLOOKUP(A2,[2]總表!$A$1:$I$486,9,0)","v":0},"ETC",1669841845,null,"Manual"]
["TW006291001B","ONE TIME CUSTOMER",null,null,"ETC","ETC","ETC","ETC","ETC_TT","TW006291001B",null,"ETC",{"$f":"M1-M2","v":0},null,"Bill To Code","Bill To Short Name","區"]
["PH000001009B","LGEPH",null,null,"ETC","ETC","ETC","ETC","ETC_TT","PH000001009B",808622,"ETC",null,null,"TW003182001B","聯強國際股份有限公司","行動電話 "]
["VN007883040B","LGEVH",null,null,"ETC","ETC","ETC","ETC","ETC_TT","VN007883040B",null,"ETC",null,null,"TW004610001B","神坊資訊股份有限公司","ONLINE"]
["ZA000001060B","LGESA",null,null,"ETC","ETC","ETC","ETC","ETC_TT","ZA000001060B",7837445,"ETC",null,null,"TW005578001B","大同綜合訊電股份有限公司","大同"]
["SG001062061B","LGESL",null,null,"ETC","ETC","ETC","ETC","ETC_TT","SG001062061B",1822154,"ETC",null,null,"TW006171001B","葳訊企業股份有限公司","行動電話 "]
["TW002070001B","來福電器商行","19600401","08026783","高屏營銷處","高屏營銷處","高屏","DEALER_TT","DCS_TT","TW002070001B",95503,"高屏營銷處",null,null,"TW006207001B","包昇數位文化有限公司","ONLINE"]
["TW002073001B","貴櫻音響","19660906","95987415","高屏營銷處","高屏營銷處","高屏","DEALER_TT","DLC_TT",null,null,null,null,null,"TW006404001B","精傑","行動電話 "]
["TW002076001B","億興電業行","19640715","70940630","高屏營銷處","高屏營銷處","高屏","DEALER_TT","DCS_TT","TW002076001B",0,"高屏營銷處",null,null,"TW006531001B","地標電通有限公司","行動電話 "]
["TW002077001B","信一電器行","19520302","91730759","高屏營銷處","高屏營銷處","高屏","DEALER_TT","DLC_TT","TW002077001B",48875,"高屏營銷處",null,null,"TW006869001B","雅光有限公司","ETC"]
["TW002079001B","立陞電器","19600710","23956174","高屏營銷處","高屏營銷處","高屏","DEALER_TT","DLC_TT","TW002079001B",0,"高屏營銷處",null,null,"TW006533001B","傑升通信股份有限公司","行動電話 "]
["TW002083001B","路得企業有限公司","19600503","84672419","高屏營銷處","高屏營銷處","高屏","DEALER_TT","SPD_TT","TW002083001B",296356,"高屏營銷處",null,null,"TW004881001B","台灣大哥大股份有限公司","行動電話 "]
["TW002084001B","新進發企業行","19520414","90802950","高屏營銷處","高屏營銷處","高屏","DEALER_TT","DLC_TT"]
["TW002085001B","皇昇電器行","19600320","08069071","高屏營銷處","高屏營銷處","高屏","DEALER_TT","DLC_TT"]
["TW002090001B","慶旺電器有限公司","hw7498625","hw16826605","高屏營銷處","高屏營銷處","高屏","DEALER_TT","DLC_TT","TW002090001B",0,"高屏營銷處"]
["TW002091001B","人友電器行","19601028","77003547","高屏營銷處","高屏營銷處","高屏","DEALER_TT","DLC_TT","TW002091001B",0,"高屏營銷處"]
["TW002093001B","鴻嘉電化商行","19480106","06696505","高屏營銷處","高屏營銷處","高屏","DEALER_TT","DCS_TT","TW002093001B",70993,"高屏營銷處"]
["TW002094001B","力利企業有限公司","19660912","16683445","高屏營銷處","高屏營銷處","高屏","DEALER_TT","DCS_TT","TW002094001B",151195,"高屏營銷處"]
["TW002099001B","淙勝電器有限公司","19580807","16476213","高屏營銷處","高屏營銷處","高屏","DEALER_TT","DCS_TT","TW002099001B",null,"高屏營銷處"]
["TW002104001B","三豐電器行","19681110","19661607","高屏營銷處","高屏營銷處","高屏","DEALER_TT","DLC_TT","TW002104001B",73861,"高屏營銷處"]
["TW002105001B","上眾電器有限公司","19600908","97408406","高屏營銷處","高屏營銷處","高屏","DEALER_TT","DCS_TT","TW002105001B",413202,"高屏營銷處"]
["TW002106001B","大時代量販家電","19670921","07910980","高屏營銷處","高屏營銷處","高屏","DEALER_TT","SPD_TT","TW002106001B",1226658,"高屏營銷處"]
["TW002108001B","春聲電器有限公司","19590922","86633356","高屏營銷處","高屏營銷處","高屏","DEALER_TT","DCS_TT","TW002108001B",559607,"高屏營銷處"]
["TW002118001B","福總電業社","19551001","08519549","高屏營銷處","高屏營銷處","高屏","DEALER_TT","DCS_TT","TW002118001B",0,"高屏營銷處"]
["TW002119001B","聯立貿易有限公司","19520813","70405187","高屏營銷處","高屏營銷處","高屏","DEALER_TT","DCS_TT","TW002119001B",351835,"高屏營銷處"]
["TW002130001B","百鈴電器影視有限公司","19530824","72192956","嘉南營銷處","嘉南營銷處","嘉南","DEALER_TT","DCS_TT","TW002130001B",185441,"嘉南營銷處"]
["TW002140001B","大時代量販家電","19681011","87692727","嘉南營銷處","嘉南營銷處","嘉南","DEALER_TT","DCS_TT","TW002140001B",353847,"嘉南營銷處"]
["TW002141001B","冠銓電器有限公司","19630606","16860835","嘉南營銷處","嘉南營銷處","嘉南","DEALER_TT","SPD_TT","TW002141001B",1477509,"嘉南營銷處"]
["TW002143001B","全省電器有限公司","19701230","69689334","嘉南營銷處","嘉南營銷處","嘉南","DEALER_TT","SPD_TT","TW002143001B",3667720,"嘉南營銷處"]
["TW002144001B","歐鋒電器行","19630108","78995756","嘉南營銷處","嘉南營銷處","嘉南","DEALER_TT","DCS_TT","TW002144001B",143081,"嘉南營銷處"]
["TW002146001B","宇騰電器行","19630910","78630074","嘉南營銷處","嘉南營銷處","嘉南","DEALER_TT","DCS_TT"]
["TW002150001B","宏偉電器行","19610121","06504730","嘉南營銷處","嘉南營銷處","嘉南","DEALER_TT","DCS_TT","TW002150001B",600605,"嘉南營銷處"]
["TW002151001B","松寶電器行","19530411","85741379","嘉南營銷處","嘉南營銷處","嘉南","DEALER_TT","DLC_TT","TW002151001B",75813,"嘉南營銷處"]
["TW002152001B","世英電業行","19510120","69310389","嘉南營銷處","嘉南營銷處","嘉南","DEALER_TT","DCS_TT"]
["TW002154001B","信福電器有限公司","19710107","69279211","嘉南營銷處","嘉南營銷處","嘉南","DEALER_TT","DCS_TT","TW002154001B",2025323,"嘉南營銷處"]
["TW002155001B","老李電器企業有限公司","19541025","06375829","嘉南營銷處","嘉南營銷處","嘉南","DEALER_TT","DCS_TT","TW002155001B",80323,"嘉南營銷處"]
["TW002158001B","中美電器行","19640417","20198584","嘉南營銷處","嘉南營銷處","嘉南","DEALER_TT","DLC_TT","TW002158001B",50678,"嘉南營銷處"]
["TW002173001B","泰欣電器行","19601208","06556096","嘉南營銷處","嘉南營銷處","嘉南","DEALER_TT","SPD_TT","TW002173001B",202415,"嘉南營銷處"]
["TW002174001B","強尼電器百貨大批發","19651231","06583544","嘉南營銷處","嘉南營銷處","嘉南","DEALER_TT","DLC_TT"]
["TW002176001B","益昌電氣行","19720603","72166747","嘉南營銷處","嘉南營銷處","嘉南","DEALER_TT","SPD_TT","TW002176001B",172410,"嘉南營銷處"]
["TW002192001B","和春電器行","19681015","64910498","嘉南營銷處","嘉南營銷處","嘉南","DEALER_TT","DLC_TT","TW002192001B",0,"嘉南營銷處"]
["TW002194001B","宏達電氣行","19780611","64862377","台中營銷處","台中營銷處","台中","DEALER_TT","DCS_TT","TW002194001B",190292,"台中營銷處"]
["TW002201001B","中聯發國際企業有限公司","TW002201","16402395","台中營銷處","台中營銷處","台中","DEALER_TT","DLC_TT","TW002201001B",76555,"台中營銷處"]
["TW002204001B","鑫昌電器有限公司","22789515","22791019","台中營銷處","台中營銷處","台中","DEALER_TT","SPD_TT","TW002204001B",null,"台中營銷處"]
["TW002206001B","祥峰電器行","TW002206","61841075","台中營銷處","台中營銷處","台中","DEALER_TT","DLC_TT","TW002206001B",0,"台中營銷處"]
["TW002214001B","欣益電器行","TW002214","12043905","台中營銷處","台中營銷處","台中","DEALER_TT","SPD_TT","TW002214001B",345944,"台中營銷處"]
["TW002223001B","長紅電子專賣店","19680422","92812618","台中營銷處","台中營銷處","台中","DEALER_TT","DLC_TT","TW002223001B",0,"台中營銷處"]
["TW002228001B","嘉聲電器有限公司","TW002228","22960798","台中營銷處","台中營銷處","台中","DEALER_TT","DLC_TT"]
["TW002229001B","宏昌電器行","19590618","24151920","台中營銷處","台中營銷處","台中","DEALER_TT","DLC_TT","TW002229001B",146816,"台中營銷處"]
["TW002239001B","明信電子專賣店","19641206","77109680","台中營銷處","台中營銷處","台中","DEALER_TT","DLC_TT","TW002239001B",53491,"台中營銷處"]
["TW002245001B","明嘉電器","TW002245","23077347","台中營銷處","台中營銷處","台中","DEALER_TT","DLC_TT"]
["TW002248001B","盟音電器","TW002248","84181461","台中營銷處","台中營銷處","台中","DEALER_TT","DLC_TT"]
["TW002250001B","格愛陞有限公司","TW002250","84694814","台中營銷處","台中營銷處","台中","DEALER_TT","DCS_TT"]
["TW002252001B","沅富電器行","19611227","18334578","台中營銷處","台中營銷處","台中","DEALER_TT","SPD_TT","TW002252001B",171368,"台中營銷處"]
["TW002257001B","恆信電器有限公司","TW002257","89817694","台中營銷處","台中營銷處","台中","DEALER_TT","DCS_TT","TW002257001B",17010,"台中營銷處"]
["TW002261001B","美齊富有限公司","23893338","23811788","台中營銷處","台中營銷處","台中","DEALER_TT","DLC_TT","TW002261001B",75258,"台中營銷處"]
["TW002261002B","美齊富有限公司","XXXXXXXX","XXXXXXXX","ID/SAC Sales","ID/SAC Sales","ID & SAC","B2B_TT","CAC_TT"]
["TW002262001B","太子電業行","TW002262","77685331","台中營銷處","台中營銷處","台中","DEALER_TT","DCS_TT","TW002262001B",715616,"台中營銷處"]
["TW002265001B","大謄電器有限公司","TW002265","22915458","台中營銷處","台中營銷處","台中","DEALER_TT","DCS_TT","TW002265001B",210615,"台中營銷處"]
{"$rows_left_out":829}
{"sheet":"預算表","index":1,"n_rows":8,"n_cols":10,"rows_kept":8,"cut":false,"hidden":false,"merged":[[2,1,2,4],[0,0,0,4]]}
["注意事項：所有促銷活動獎勵辦法，依LG公司公告內容執行，需達成目標或協議後，方可取得下列協議獎勵。\nLG公司同意之促銷活動皆須有[Promotion No.]，若無即為個人行為，LG公司概不予承認。"]
[]
["2021年9月","台　灣　樂　金　電　器　股　份　有　限　公　司"]
[{"$f":"確認code正確","v":{"$error":"#N/A"}},{"$f":"店CODE","v":0},null,"密　碼"]
["店Code：",null,"第一組：",null,{"$f":"確認1","v":"0"}]
["店　名：",{"$f":"確認店","v":""},"第二組：",null,{"$f":"確認2","v":"0"}]
[{"$f":"確認區","v":{"$error":"#N/A"}},{"$f":"確認BG","v":{"$error":"#N/A"}},{"$f":"確認BG1","v":{"$error":"#N/A"}},{"$f":"R好CODE1","v":{"$error":"#N/A"}},{"$f":"R好CODE2","v":{"$error":"#N/A"}},null,null,null,null,{"$f":"R好CODE3","v":""}]
["店代號","Promotion No","Promotion Name","起始日","到期日","獎勵內容","型號","AMT/%","單價/%"]

{"sheet":"BALANCE","index":2,"n_rows":8255,"n_cols":21,"rows_kept":8255,"cut":false,"hidden":true,"merged":[]}
["Bill To Customer Code","Bill To Customer Code","Promotion No","Promotion Name","Start Date","End Date","Property Type","Start Date","End Date","內容","店代號","店名","NO","AA","AMT/%","Description","Division","Model","Unit / %","QTY / Sales","Expected Cost"]
[{"$f":"IF(RIGHT(B2,1)=\"H\",LEFT(B2,11)&\"B\",B2)","v":"TW006332001B"},"TW006332001B","TT-NTSI-20210902-0001","GWB2108H006-ALL-TW006332-Exhibition-Sale target-Limited-20210906-20210929","2021-09-06","2021-09-29",{"$f":"MID(C2,4,4)","v":"NTSI"},{"$f":"IF(OR($G2=\"NTSI\",$G2=\"TTSI\"),$E2,LEFT($E2,4)&\"/\"&MID($E2,5,2)&\"/\"&RIGHT($E2,2))","v":"2021-09-06"},{"$f":"IF(OR($G2=\"NTSI\",$G2=\"TTSI\"),$F2,LEFT($F2,4)&\"/\"&MID($F2,5,2)&\"/\"&RIGHT($F2,2))","v":"2021-09-29"},"公司-家電-萊旺特賣會個展(切結未稅250萬,達8成給予獎勵,上限未稅6.25萬)-0906~0929","TW006332001B","萊旺電器行","TW",null,"%","萊旺特賣會個展(切結未稅250萬,達8成給予獎勵,上限未稅6.25萬)",null,"全產品",null,0]
[{"$f":"IF(RIGHT(B3,1)=\"H\",LEFT(B3,11)&\"B\",B3)","v":"TW002718001B"},"TW002718001B","TT-NTSI-20210901-0001","MMCSN2109B082-DLT-TW002718-OutdoorBillboard-Cingpu-202109","2021-09-03","2021-09-30",{"$f":"MID(C3,4,4)","v":"NTSI"},"2021-09-03","2021-09-30","公司-清淨機除濕機-戶外招牌製作贊助(青埔領航DC)-09~09","TW002718001B","全國電子","TW",null,"AMT","戶外招牌製作贊助(青埔領航DC)",null,"HADHDHDJ",10000,null,10000]
[{"$f":"IF(RIGHT(B4,1)=\"H\",LEFT(B4,11)&\"B\",B4)","v":"TW002718001B"},"TW002718001B","TT-NTSI-20210901-0001","MMCSN2109B082-DLT-TW002718-OutdoorBillboard-Cingpu-202109","2021-09-03","2021-09-30",{"$f":"MID(C4,4,4)","v":"NTSI"},"2021-09-03","2021-09-30","公司-清淨機除濕機-戶外招牌製作贊助(青埔領航DC)-09~09","TW002718001B","全國電子","TW",null,"AMT","戶外招牌製作贊助(青埔領航DC)",null,"HCWCASAC",10000,null,10000]
[{"$f":"IF(RIGHT(B5,1)=\"H\",LEFT(B5,11)&\"B\",B5)","v":"TW002718001B"},"TW002718001B","TT-NTSI-20210901-0002","MMCSN2109B082-VCC-TW002718-OutdoorBillboard-Cingpu-202109","2021-09-03","2021-09-30",{"$f":"MID(C5,4,4)","v":"NTSI"},"2021-09-03","2021-09-30","公司-吸塵器-戶外招牌製作贊助(青埔領航DC)-09~09","TW002718001B","全國電子","TW",null,"AMT","戶外招牌製作贊助(青埔領航DC)",null,"吸塵器",60000,null,60000]
[{"$f":"IF(RIGHT(B6,1)=\"H\",LEFT(B6,11)&\"B\",B6)","v":"DEALER_DEPT"},"DEALER_DEPT","TT-NTSO-20210917-0001","HPC2109D007-TV-Dept-SOA-20210921~0930",20210921,20210930,{"$f":"MID(C6,4,4)","v":"NTSO"},"2021/09/21","2021/09/30","公司-電視-實銷補助-0921~0930","DEALER_DEPT","Dealer_Dept",null,null,"AMT","實銷補助",null,"OLED77CXPWA.ATT",50000,6,300000]
[{"$f":"IF(RIGHT(B7,1)=\"H\",LEFT(B7,11)&\"B\",B7)","v":"DEALER_DEPT"},"DEALER_DEPT","TT-NTSO-20210917-0001","HPC2109D007-TV-Dept-SOA-20210921~0930",20210921,20210930,{"$f":"MID(C7,4,4)","v":"NTSO"},"2021/09/21","2021/09/30","公司-電視-實銷補助-0921~0930","DEALER_DEPT","Dealer_Dept",null,null,"AMT","實銷補助",null,"OLED77CXPWA.ATT",40000,4,160000]
["MMCS_RT","MMCS_RT","TT-NTSO-20210922-0001","MMCSN2109J028-VCC-RT-SOA-20210924~0930",20210924,20210930,"NTSO","2021/09/24","2021/09/30","公司-吸塵器-短期實銷加碼-0924~0930","MMCS_RT","MMCS_RT",null,null,"AMT","短期實銷加碼",null,"A9PSMOP2X.AIGBLTT",1980,10,19800]
["MMCS_RT","MMCS_RT","TT-NTSO-20210922-0001","MMCSN2109J028-VCC-RT-SOA-20210924~0930",20210924,20210930,"NTSO","2021/09/24","2021/09/30","公司-吸塵器-短期實銷加碼-0924~0930","MMCS_RT","MMCS_RT",null,null,"AMT","短期實銷加碼",null,"A9P-CORE.BFSBLTT",1638,15,24570]
["MMCS_RT","MMCS_RT","TT-NTSO-20210922-0001","MMCSN2109J028-VCC-RT-SOA-20210924~0930",20210924,20210930,"NTSO","2021/09/24","2021/09/30","公司-吸塵器-短期實銷加碼-0924~0930","MMCS_RT","MMCS_RT",null,null,"AMT","短期實銷加碼",null,"V-DDMOPNZ.AKVNLTT",3429,15,51435]
["TW002456001B","TW002456001B","TT-NTSO-20210906-0001","MMCSN2109A035-VCC-TW002456-SOA-202109",20210909,20210930,"NTSO","2021/09/09","2021/09/30","公司-吸塵器-實銷補助-09.09~09.30","TW002456001B","燦坤",null,null,"AMT","實銷補助",null,"A9P-CORE.BFSBLTT",800,50,40000]
["TW002456001B","TW002456001B","TT-NTSO-20210906-0001","MMCSN2109A035-VCC-TW002456-SOA-202109",20210909,20210930,"NTSO","2021/09/09","2021/09/30","公司-吸塵器-實銷補助-09.09~09.30","TW002456001B","燦坤",null,null,"AMT","實銷補助",null,"M9MAX.AFSBLTT",1600,50,80000]
["TW002456001B","TW002456001B","TT-NTSO-20210909-0001","MMCSN2109A014-TV-TW002456-EOL(8NO)-202109",20210911,20210930,"NTSO","2021/09/11","2021/09/30","公司-電視-出清補助(8貨號)-09.11~09.30","TW002456001B","燦坤",null,null,"AMT","出清補助(8貨號)",null,"OLED65CXPWA.ATT",8381,12,100572]
["TW002456001B","TW002456001B","TT-NTSO-20210909-0001","MMCSN2109A014-TV-TW002456-EOL(8NO)-202109",20210911,20210930,"NTSO","2021/09/11","2021/09/30","公司-電視-出清補助(8貨號)-09.11~09.30","TW002456001B","燦坤",null,null,"AMT","出清補助(8貨號)",null,"OLED65GXPWA.ATT",8381,12,100572]
["TW002456001B","TW002456001B","TT-NTSO-20210914-0001","MMCSN2109A016-TV-TW002456-Gift-202109",20210915,20210930,"NTSO","2021/09/15","2021/09/30","公司-電視-實銷贈品-09.15~09.30","TW002456001B","燦坤",null,null,"AMT","實銷贈品",null,"55NANO76SPA.ATT",1000,100,100000]
["TW002456001B","TW002456001B","TT-NTSO-20210914-0001","MMCSN2109A016-TV-TW002456-Gift-202109",20210915,20210930,"NTSO","2021/09/15","2021/09/30","公司-電視-實銷贈品-09.15~09.30","TW002456001B","燦坤",null,null,"AMT","實銷贈品",null,"55NANO86SPA.ATT",1000,50,50000]
["TW002456001B","TW002456001B","TT-NTSO-20210914-0001","MMCSN2109A016-TV-TW002456-Gift-202109",20210915,20210930,"NTSO","2021/09/15","2021/09/30","公司-電視-實銷贈品-09.15~09.30","TW002456001B","燦坤",null,null,"AMT","實銷贈品",null,"65NANO86SPA.ATT",3000,50,150000]
["TW002811001B","TW002811001B","TT-NTSO-20210906-0004","HETV20210906-TV-TW002811-RoadshowSOA-20210911~0920",20210911,20210920,"NTSO","2021/09/11","2021/09/20","公司-電視-9/11~9/12 Roadshow實銷-0911~0920","TW002811001B","棋杰電器",null,null,"AMT","9/11~9/12 Roadshow實銷",null,"OLED65G1PSA.ATT",5000,1,5000]
["TW002811001B","TW002811001B","TT-NTSO-20210906-0004","HETV20210906-TV-TW002811-RoadshowSOA-20210911~0920",20210911,20210920,"NTSO","2021/09/11","2021/09/20","公司-電視-9/11~9/12 Roadshow實銷-0911~0920","TW002811001B","棋杰電器",null,null,"AMT","9/11~9/12 Roadshow實銷",null,"OLED55G1PSA.ATT",3000,1,3000]
["TW002811001B","TW002811001B","TT-NTSO-20210906-0004","HETV20210906-TV-TW002811-RoadshowSOA-20210911~0920",20210911,20210920,"NTSO","2021/09/11","2021/09/20","公司-電視-9/11~9/12 Roadshow實銷-0911~0920","TW002811001B","棋杰電器",null,null,"AMT","9/11~9/12 Roadshow實銷",null,"OLED65C1PSB.ATT",5000,1,5000]
["TW002811001B","TW002811001B","TT-NTSO-20210906-0004","HETV20210906-TV-TW002811-RoadshowSOA-20210911~0920",20210911,20210920,"NTSO","2021/09/11","2021/09/20","公司-電視-9/11~9/12 Roadshow實銷-0911~0920","TW002811001B","棋杰電器",null,null,"AMT","9/11~9/12 Roadshow實銷",null,"OLED55C1PSB.ATT",3000,1,3000]
["TW003040001B","TW003040001B","TT-NTSO-20210908-0001","TPB2109A004-STYLER-TW003040-SOA-20210915~0930",20210915,20210930,"NTSO","2021/09/15","2021/09/30","公司-電子衣櫥-實銷補助-0915~0930","TW003040001B","悅鼎電器",null,null,"AMT","實銷補助",null,"E523FR.ALBBTST",3000,3,9000]
["TW003040001B","TW003040001B","TT-NTSO-20210908-0001","TPB2109A004-STYLER-TW003040-SOA-20210915~0930",20210915,20210930,"NTSO","2021/09/15","2021/09/30","公司-電子衣櫥-實銷補助-0915~0930","TW003040001B","悅鼎電器",null,null,"AMT","實銷補助",null,"E523MR.ALBBTST",3000,3,9000]
["TW003040001B","TW003040001B","TT-NTSO-20210908-0001","TPB2109A004-STYLER-TW003040-SOA-20210915~0930",20210915,20210930,"NTSO","2021/09/15","2021/09/30","公司-電子衣櫥-實銷補助-0915~0930","TW003040001B","悅鼎電器",null,null,"AMT","實銷補助",null,"E523IR.ABWBTST",3000,3,9000]
["TW003040001B","TW003040001B","TT-NTSO-20210908-0001","TPB2109A004-STYLER-TW003040-SOA-20210915~0930",20210915,20210930,"NTSO","2021/09/15","2021/09/30","公司-電子衣櫥-實銷補助-0915~0930","TW003040001B","悅鼎電器",null,null,"AMT","實銷補助",null,"B723MR.ALMBTST",3000,3,9000]
["TW003310001B","TW003310001B","TT-NTSO-20210903-0002","DWB2109F008-TV-DWB-RoadshowSOA-0907~0930",20210907,20210930,"NTSO","2021/09/07","2021/09/30","公司-電視-桃園八德廣豐合展實銷補助-0907~0931","TW003310001B","陽曜企業",null,null,"AMT","桃園八德廣豐合展實銷補助",null,"OLED65G1PSA.ATT",4761,2,9522]
["TW003310001B","TW003310001B","TT-NTSO-20210903-0002","DWB2109F008-TV-DWB-RoadshowSOA-0907~0930",20210907,20210930,"NTSO","2021/09/07","2021/09/30","公司-電視-桃園八德廣豐合展實銷補助-0907~0931","TW003310001B","陽曜企業",null,null,"AMT","桃園八德廣豐合展實銷補助",null,"OLED55G1PSA.ATT",2857,2,5714]
["TW003310001B","TW003310001B","TT-NTSO-20210903-0002","DWB2109F008-TV-DWB-RoadshowSOA-0907~0930",20210907,20210930,"NTSO","2021/09/07","2021/09/30","公司-電視-桃園八德廣豐合展實銷補助-0907~0931","TW003310001B","陽曜企業",null,null,"AMT","桃園八德廣豐合展實銷補助",null,"OLED65C1PSB.ATT",4761,2,9522]
["TW003310001B","TW003310001B","TT-NTSO-20210903-0002","DWB2109F008-TV-DWB-RoadshowSOA-0907~0930",20210907,20210930,"NTSO","2021/09/07","2021/09/30","公司-電視-桃園八德廣豐合展實銷補助-0907~0931","TW003310001B","陽曜企業",null,null,"AMT","桃園八德廣豐合展實銷補助",null,"OLED55C1PSB.ATT",2857,2,5714]
["TW003310001B","TW003310001B","TT-NTSO-20210903-0002","DWB2109F008-TV-DWB-RoadshowSOA-0907~0930",20210907,20210930,"NTSO","2021/09/07","2021/09/30","公司-電視-桃園八德廣豐合展實銷補助-0907~0931","TW003310001B","陽曜企業",null,null,"AMT","桃園八德廣豐合展實銷補助",null,"86NANO91SPA.ATT",4761,2,9522]
["TW003310001B","TW003310001B","TT-NTSO-20210903-0002","DWB2109F008-TV-DWB-RoadshowSOA-0907~0930",20210907,20210930,"NTSO","2021/09/07","2021/09/30","公司-電視-桃園八德廣豐合展實銷補助-0907~0931","TW003310001B","陽曜企業",null,null,"AMT","桃園八德廣豐合展實銷補助",null,"75NANO91SPA.ATT",2857,2,5714]
["TW003898001B","TW003898001B","TT-NTSO-20210906-0008","DNB2109K003-TV-TW003898-SOA-202109",20210907,20210929,"NTSO","2021/09/07","2021/09/29","公司-電視-實銷補助(個展)-09.07~09.29","TW003898001B","科昌電器",null,null,"AMT","實銷補助(個展)",null,"OLED65G1PSA.ATT",4762,1,4762]
["TW003898001B","TW003898001B","TT-NTSO-20210906-0008","DNB2109K003-TV-TW003898-SOA-202109",20210907,20210929,"NTSO","2021/09/07","2021/09/29","公司-電視-實銷補助(個展)-09.07~09.29","TW003898001B","科昌電器",null,null,"AMT","實銷補助(個展)",null,"OLED55G1PSA.ATT",2857,1,2857]
["TW003898001B","TW003898001B","TT-NTSO-20210906-0008","DNB2109K003-TV-TW003898-SOA-202109",20210907,20210929,"NTSO","2021/09/07","2021/09/29","公司-電視-實銷補助(個展)-09.07~09.29","TW003898001B","科昌電器",null,null,"AMT","實銷補助(個展)",null,"OLED65C1PSB.ATT",4762,3,14286]
["TW003898001B","TW003898001B","TT-NTSO-20210906-0008","DNB2109K003-TV-TW003898-SOA-202109",20210907,20210929,"NTSO","2021/09/07","2021/09/29","公司-電視-實銷補助(個展)-09.07~09.29","TW003898001B","科昌電器",null,null,"AMT","實銷補助(個展)",null,"OLED55C1PSB.ATT",2857,3,8571]
["TW004349001B","TW004349001B","TT-NTSO-20210915-0002","HETV20210913-TV-TW004349-RoadshowSOA-20210917~0924",20210917,20210924,"NTSO","2021/09/17","2021/09/24","公司-電視-9/17~9/18 Roadshow實銷-0917~0924","TW004349001B","瑨耀企業",null,null,"AMT","9/17~9/18 Roadshow實銷",null,"OLED65G1PSA.ATT",5000,1,5000]
["TW004349001B","TW004349001B","TT-NTSO-20210915-0002","HETV20210913-TV-TW004349-RoadshowSOA-20210917~0924",20210917,20210924,"NTSO","2021/09/17","2021/09/24","公司-電視-9/17~9/18 Roadshow實銷-0917~0924","TW004349001B","瑨耀企業",null,null,"AMT","9/17~9/18 Roadshow實銷",null,"OLED55G1PSA.ATT",3000,1,3000]
["TW004349001B","TW004349001B","TT-NTSO-20210915-0002","HETV20210913-TV-TW004349-RoadshowSOA-20210917~0924",20210917,20210924,"NTSO","2021/09/17","2021/09/24","公司-電視-9/17~9/18 Roadshow實銷-0917~0924","TW004349001B","瑨耀企業",null,null,"AMT","9/17~9/18 Roadshow實銷",null,"OLED65C1PSB.ATT",5000,1,5000]
["TW004349001B","TW004349001B","TT-NTSO-20210915-0002","HETV20210913-TV-TW004349-RoadshowSOA-20210917~0924",20210917,20210924,"NTSO","2021/09/17","2021/09/24","公司-電視-9/17~9/18 Roadshow實銷-0917~0924","TW004349001B","瑨耀企業",null,null,"AMT","9/17~9/18 Roadshow實銷",null,"OLED55C1PSB.ATT",3000,1,3000]
["TW004399001B","TW004399001B","TT-NTSO-20210901-0002","HETV20210830-TV-TW004399-RoadshowSOA-20210904~0913",20210904,20210913,"NTSO","2021/09/04","2021/09/13","公司-電視-9/4~9/6 Roadshow實銷-0904~0913","TW004399001B","祥建科技",null,null,"AMT","9/4~9/6 Roadshow實銷",null,"OLED65G1PSA.ATT",5000,1,5000]
["TW004399001B","TW004399001B","TT-NTSO-20210901-0002","HETV20210830-TV-TW004399-RoadshowSOA-20210904~0913",20210904,20210913,"NTSO","2021/09/04","2021/09/13","公司-電視-9/4~9/6 Roadshow實銷-0904~0913","TW004399001B","祥建科技",null,null,"AMT","9/4~9/6 Roadshow實銷",null,"OLED55G1PSA.ATT",3000,1,3000]
["TW004399001B","TW004399001B","TT-NTSO-20210901-0002","HETV20210830-TV-TW004399-RoadshowSOA-20210904~0913",20210904,20210913,"NTSO","2021/09/04","2021/09/13","公司-電視-9/4~9/6 Roadshow實銷-0904~0913","TW004399001B","祥建科技",null,null,"AMT","9/4~9/6 Roadshow實銷",null,"OLED65C1PSB.ATT",5000,1,5000]
["TW004399001B","TW004399001B","TT-NTSO-20210901-0002","HETV20210830-TV-TW004399-RoadshowSOA-20210904~0913",20210904,20210913,"NTSO","2021/09/04","2021/09/13","公司-電視-9/4~9/6 Roadshow實銷-0904~0913","TW004399001B","祥建科技",null,null,"AMT","9/4~9/6 Roadshow實銷",null,"OLED55C1PSB.ATT",3000,1,3000]
["TW004399001B","TW004399001B","TT-NTSO-20210906-0005","HETV20210906-TV-TW004399-RoadshowSOA-20210911~0920",20210911,20210920,"NTSO","2021/09/11","2021/09/20","公司-電視-9/11~9/12 Roadshow實銷-0911~0920","TW004399001B","祥建科技",null,null,"AMT","9/11~9/12 Roadshow實銷",null,"OLED65G1PSA.ATT",5000,1,5000]
["TW004399001B","TW004399001B","TT-NTSO-20210906-0005","HETV20210906-TV-TW004399-RoadshowSOA-20210911~0920",20210911,20210920,"NTSO","2021/09/11","2021/09/20","公司-電視-9/11~9/12 Roadshow實銷-0911~0920","TW004399001B","祥建科技",null,null,"AMT","9/11~9/12 Roadshow實銷",null,"OLED55G1PSA.ATT",3000,1,3000]
["TW004399001B","TW004399001B","TT-NTSO-20210906-0005","HETV20210906-TV-TW004399-RoadshowSOA-20210911~0920",20210911,20210920,"NTSO","2021/09/11","2021/09/20","公司-電視-9/11~9/12 Roadshow實銷-0911~0920","TW004399001B","祥建科技",null,null,"AMT","9/11~9/12 Roadshow實銷",null,"OLED65C1PSB.ATT",5000,1,5000]
["TW004399001B","TW004399001B","TT-NTSO-20210906-0005","HETV20210906-TV-TW004399-RoadshowSOA-20210911~0920",20210911,20210920,"NTSO","2021/09/11","2021/09/20","公司-電視-9/11~9/12 Roadshow實銷-0911~0920","TW004399001B","祥建科技",null,null,"AMT","9/11~9/12 Roadshow實銷",null,"OLED55C1PSB.ATT",3000,1,3000]
["TW004700001B","TW004700001B","TT-NTSO-20210903-0002","DWB2109F008-TV-DWB-RoadshowSOA-0907~0930",20210907,20210930,"NTSO","2021/09/07","2021/09/30","公司-電視-桃園八德廣豐合展實銷補助-0907~0931","TW004700001B","鐠羅影音",null,null,"AMT","桃園八德廣豐合展實銷補助",null,"OLED65G1PSA.ATT",4761,2,9522]
["TW004700001B","TW004700001B","TT-NTSO-20210903-0002","DWB2109F008-TV-DWB-RoadshowSOA-0907~0930",20210907,20210930,"NTSO","2021/09/07","2021/09/30","公司-電視-桃園八德廣豐合展實銷補助-0907~0931","TW004700001B","鐠羅影音",null,null,"AMT","桃園八德廣豐合展實銷補助",null,"OLED55G1PSA.ATT",2857,2,5714]
["TW004700001B","TW004700001B","TT-NTSO-20210903-0002","DWB2109F008-TV-DWB-RoadshowSOA-0907~0930",20210907,20210930,"NTSO","2021/09/07","2021/09/30","公司-電視-桃園八德廣豐合展實銷補助-0907~0931","TW004700001B","鐠羅影音",null,null,"AMT","桃園八德廣豐合展實銷補助",null,"OLED65C1PSB.ATT",4761,2,9522]
["TW004700001B","TW004700001B","TT-NTSO-20210903-0002","DWB2109F008-TV-DWB-RoadshowSOA-0907~0930",20210907,20210930,"NTSO","2021/09/07","2021/09/30","公司-電視-桃園八德廣豐合展實銷補助-0907~0931","TW004700001B","鐠羅影音",null,null,"AMT","桃園八德廣豐合展實銷補助",null,"OLED55C1PSB.ATT",2857,2,5714]
["TW004700001B","TW004700001B","TT-NTSO-20210903-0002","DWB2109F008-TV-DWB-RoadshowSOA-0907~0930",20210907,20210930,"NTSO","2021/09/07","2021/09/30","公司-電視-桃園八德廣豐合展實銷補助-0907~0931","TW004700001B","鐠羅影音",null,null,"AMT","桃園八德廣豐合展實銷補助",null,"86NANO91SPA.ATT",4761,2,9522]
["TW004700001B","TW004700001B","TT-NTSO-20210903-0002","DWB2109F008-TV-DWB-RoadshowSOA-0907~0930",20210907,20210930,"NTSO","2021/09/07","2021/09/30","公司-電視-桃園八德廣豐合展實銷補助-0907~0931","TW004700001B","鐠羅影音",null,null,"AMT","桃園八德廣豐合展實銷補助",null,"75NANO91SPA.ATT",2857,2,5714]
["TW004724001B","TW004724001B","TT-NTSO-20210903-0002","DWB2109F008-TV-DWB-RoadshowSOA-0907~0930",20210907,20210930,"NTSO","2021/09/07","2021/09/30","公司-電視-桃園八德廣豐合展實銷補助-0907~0931","TW004724001B","新視紀科技",null,null,"AMT","桃園八德廣豐合展實銷補助",null,"OLED65G1PSA.ATT",4761,2,9522]
["TW004724001B","TW004724001B","TT-NTSO-20210903-0002","DWB2109F008-TV-DWB-RoadshowSOA-0907~0930",20210907,20210930,"NTSO","2021/09/07","2021/09/30","公司-電視-桃園八德廣豐合展實銷補助-0907~0931","TW004724001B","新視紀科技",null,null,"AMT","桃園八德廣豐合展實銷補助",null,"OLED55G1PSA.ATT",2857,2,5714]
["TW004724001B","TW004724001B","TT-NTSO-20210903-0002","DWB2109F008-TV-DWB-RoadshowSOA-0907~0930",20210907,20210930,"NTSO","2021/09/07","2021/09/30","公司-電視-桃園八德廣豐合展實銷補助-0907~0931","TW004724001B","新視紀科技",null,null,"AMT","桃園八德廣豐合展實銷補助",null,"OLED65C1PSB.ATT",4761,2,9522]
["TW004724001B","TW004724001B","TT-NTSO-20210903-0002","DWB2109F008-TV-DWB-RoadshowSOA-0907~0930",20210907,20210930,"NTSO","2021/09/07","2021/09/30","公司-電視-桃園八德廣豐合展實銷補助-0907~0931","TW004724001B","新視紀科技",null,null,"AMT","桃園八德廣豐合展實銷補助",null,"OLED55C1PSB.ATT",2857,2,5714]
["TW004724001B","TW004724001B","TT-NTSO-20210903-0002","DWB2109F008-TV-DWB-RoadshowSOA-0907~0930",20210907,20210930,"NTSO","2021/09/07","2021/09/30","公司-電視-桃園八德廣豐合展實銷補助-0907~0931","TW004724001B","新視紀科技",null,null,"AMT","桃園八德廣豐合展實銷補助",null,"86NANO91SPA.ATT",4761,2,9522]
["TW004724001B","TW004724001B","TT-NTSO-20210903-0002","DWB2109F008-TV-DWB-RoadshowSOA-0907~0930",20210907,20210930,"NTSO","2021/09/07","2021/09/30","公司-電視-桃園八德廣豐合展實銷補助-0907~0931","TW004724001B","新視紀科技",null,null,"AMT","桃園八德廣豐合展實銷補助",null,"75NANO91SPA.ATT",2857,2,5714]
["TW004758001B","TW004758001B","TT-NTSO-20210901-0003","HETV20210830-TV-TW004758-RoadshowSOA-20210904~0913",20210904,20210913,"NTSO","2021/09/04","2021/09/13","公司-電視-9/4~9/6 Roadshow實銷-0904~0913","TW004758001B","同勝電器",null,null,"AMT","9/4~9/6 Roadshow實銷",null,"OLED65G1PSA.ATT",5000,1,5000]
{"$rows_left_out":8195}