{"text_format":"1","workbook":"xlsx","n_sheets":3,"sheets":["資料勿動","預算表","BALANCE"],"not_rendered":{"charts":0,"images":2,"macros":1,"external_links":2,"defined_names":15,"comments":2,"pivot_tables":0},"unopened":[],"bounds":{"document_bytes":16777216,"sheet_cells":100000,"rows_first":2000,"rows_last":500,"rows_between":2000,"halvings":0,"cell_chars":16384,"cell_head_chars":4096},"cells_cut":0,"cells_raw":0,"read":"whole","date_system":"1900"}

{"sheet":"資料勿動","index":0,"n_rows":888,"n_cols":17,"rows_kept":888,"cut":false,"hidden":true,"merged":[]}
["Bill To Code","Bill To Short Name","第一組","第二組","部門名稱","區","區1","BUYING_GROUP","BUYING_GROUP-1","Sales Channel Name","Sales AR","AR Sales Channel",{"$f":"SUM(K:K)","v":1669841845}]
["TW002512001B","ONE TIME CUSTOMER",null,null,"ETC","ETC","ETC","ETC","ETC_TT","TW002512001B",{"$f":"VLOOKUP(A2,[2]總表!$A$1:$I$486,9,0)","v":0},"ETC",1669841845,null,"Manual"]
["TW006291001B","ONE TIME CUSTOMER",null,null,"ETC","ETC","ETC","ETC","ETC_TT","TW006291001B",null,"ETC",{"$f":"M1-M2","v":0},null,"Bill To Code","Bill To Short Name","區"]
["PH000001009B","LGEPH",null,null,"ETC","ETC","ETC","ETC","ETC_TT","PH000001009B",808622,"ETC",null,null,"TW003182001B","聯強國際股份有限公司","行動電話 "]
["VN007883040B","LGEVH",null,null,"ETC","ETC","ETC","ETC","ETC_TT","VN007883040B",null,"ETC",null,null,"TW004610001B","神坊資訊股份有限公司","ONLINE"]
["ZA000001060B","LGESA",null,null,"ETC","ETC","ETC","ETC","ETC_TT","ZA000001060B",7837445,"ETC",null,null,"TW005578001B","大同綜合訊電股份有限公司","大同"]
["SG001062061B","LGESL",null,null,"ETC","ETC","ETC","ETC","ETC_TT","SG001062061B",1822154,"ETC",null,null,"TW006171001B","葳訊企業股份有限公司","行動電話 "]
["TW002070001B","來福電器商行","19600401","08026783","高屏營銷處","高屏營銷處","高屏","DEALER_TT","DCS_TT","TW002070001B",95503,"高屏營銷處",null,null,"TW006207001B","包昇數位文化有限公司","ONLINE"]
["TW002073001B","貴櫻音響","19660906","95987415","高屏營銷處","高屏營銷處","高屏","DEALER_TT","DLC_TT",null,null,null,null,null,"TW006404001B","精傑","行動電話 "]
["TW002076001B","億興電業行","19640715","70940630","高屏營銷處","高屏營銷處","高屏","DEALER_TT","DCS_TT","TW002076001B",0,"高屏營銷處",null,null,"TW006531001B","地標電通有限公司","行動電話 "]
["TW002077001B","信一電器行","19520302","91730759","高屏營銷處","高屏營銷處","高屏","DEALER_TT","DLC_TT","TW002077001B",48875,"高屏營銷處",null,null,"TW006869001B","雅光有限公司","ETC"]
["TW002079001B","立陞電器","19600710","23956174","高屏營銷處","高屏營銷處","高屏","DEALER_TT","DLC_TT","TW002079001B",0,"高屏營銷處",null,null,"TW006533001B","傑升通信股份有限公司","行動電話 "]
["TW002083001B","路得企業有限公司","19600503","84672419","高屏營銷處","高屏營銷處","高屏","DEALER_TT","SPD_TT","TW002083001B",296356,"高屏營銷處",null,null,"TW004881001B","台灣大哥大股份有限公司","行動電話 "]
["TW002084001B","新進發企業行","19520414","90802950","高屏營銷處","高屏營銷處","高屏","DEALER_TT","DLC_TT"]
["TW002085001B","皇昇電器行","19600320","08069071","高屏營銷處","高屏營銷處","高屏","DEALER_TT","DLC_TT"]
["TW002090001B","慶旺電器有限公司","hw7498625","hw16826605","高屏營銷處","高屏營銷處","高屏","DEALER_TT","DLC_TT","TW002090001B",0,"高屏營銷處"]
["TW002091001B","人友電器行","19601028","77003547","高屏營銷處","高屏營銷處","高屏","DEALER_TT","DLC_TT","TW002091001B",0,"高屏營銷處"]
["TW002093001B","鴻嘉電化商行","19480106","06696505","高屏營銷處","高屏營銷處","高屏","DEALER_TT","DCS_TT","TW002093001B",70993,"高屏營銷處"]
["TW002094001B","力利企業有限公司","19660912","16683445","高屏營銷處","高屏營銷處","高屏","DEALER_TT","DCS_TT","TW002094001B",151195,"高屏營銷處"]
["TW002099001B","淙勝電器有限公司","19580807","16476213","高屏營銷處","高屏營銷處","高屏","DEALER_TT","DCS_TT","TW002099001B",null,"高屏營銷處"]
["TW002104001B","三豐電器行","19681110","19661607","高屏營銷處","高屏營銷處","高屏","DEALER_TT","DLC_TT","TW002104001B",73861,"高屏營銷處"]
["TW002105001B","上眾電器有限公司","19600908","97408406","高屏營銷處","高屏營銷處","高屏","DEALER_TT","DCS_TT","TW002105001B",413202,"高屏營銷處"]
["TW002106001B","大時代量販家電","19670921","07910980","高屏營銷處","高屏營銷處","高屏","DEALER_TT","SPD_TT","TW002106001B",1226658,"高屏營銷處"]
["TW002108001B","春聲電器有限公司","19590922","86633356","高屏營銷處","高屏營銷處","高屏","DEALER_TT","DCS_TT","TW002108001B",559607,"高屏營銷處"]
["TW002118001B","福總電業社","19551001","08519549","高屏營銷處","高屏營銷處","高屏","DEALER_TT","DCS_TT","TW002118001B",0,"高屏營銷處"]
["TW002119001B","聯立貿易有限公司","19520813","70405187","高屏營銷處","高屏營銷處","高屏","DEALER_TT","DCS_TT","TW002119001B",351835,"高屏營銷處"]
["TW002130001B","百鈴電器影視有限公司","19530824","72192956","嘉南營銷處","嘉南營銷處","嘉南","DEALER_TT","DCS_TT","TW002130001B",185441,"嘉南營銷處"]
["TW002140001B","大時代量販家電","19681011","87692727","嘉南營銷處","嘉南營銷處","嘉南","DEALER_TT","DCS_TT","TW002140001B",353847,"嘉南營銷處"]
["TW002141001B","冠銓電器有限公司","19630606","16860835","嘉南營銷處","嘉南營銷處","嘉南","DEALER_TT","SPD_TT","TW002141001B",1477509,"嘉南營銷處"]
["TW002143001B","全省電器有限公司","19701230","69689334","嘉南營銷處","嘉南營銷處","嘉南","DEALER_TT","SPD_TT","TW002143001B",3667720,"嘉南營銷處"]
["TW002144001B","歐鋒電器行","19630108","78995756","嘉南營銷處","嘉南營銷處","嘉南","DEALER_TT","DCS_TT","TW002144001B",143081,"嘉南營銷處"]
["TW002146001B","宇騰電器行","19630910","78630074","嘉南營銷處","嘉南營銷處","嘉南","DEALER_TT","DCS_TT"]
["TW002150001B","宏偉電器行","19610121","06504730","嘉南營銷處","嘉南營銷處","嘉南","DEALER_TT","DCS_TT","TW002150001B",600605,"嘉南營銷處"]
["TW002151001B","松寶電器行","19530411","85741379","嘉南營銷處","嘉南營銷處","嘉南","DEALER_TT","DLC_TT","TW002151001B",75813,"嘉南營銷處"]
["TW002152001B","世英電業行","19510120","69310389","嘉南營銷處","嘉南營銷處","嘉南","DEALER_TT","DCS_TT"]
["TW002154001B","信福電器有限公司","19710107","69279211","嘉南營銷處","嘉南營銷處","嘉南","DEALER_TT","DCS_TT","TW002154001B",2025323,"嘉南營銷處"]
["TW002155001B","老李電器企業有限公司","19541025","06375829","嘉南營銷處","嘉南營銷處","嘉南","DEALER_TT","DCS_TT","TW002155001B",80323,"嘉南營銷處"]
["TW002158001B","中美電器行","19640417","20198584","嘉南營銷處","嘉南營銷處","嘉南","DEALER_TT","DLC_TT","TW002158001B",50678,"嘉南營銷處"]
["TW002173001B","泰欣電器行","19601208","06556096","嘉南營銷處","嘉南營銷處","嘉南","DEALER_TT","SPD_TT","TW002173001B",202415,"嘉南營銷處"]
["TW002174001B","強尼電器百貨大批發","19651231","06583544","嘉南營銷處","嘉南營銷處","嘉南","DEALER_TT","DLC_TT"]
["TW002176001B","益昌電氣行","19720603","72166747","嘉南營銷處","嘉南營銷處","嘉南","DEALER_TT","SPD_TT","TW002176001B",172410,"嘉南營銷處"]
["TW002192001B","和春電器行","19681015","64910498","嘉南營銷處","嘉南營銷處","嘉南","DEALER_TT","DLC_TT","TW002192001B",0,"嘉南營銷處"]
["TW002194001B","宏達電氣行","19780611","64862377","台中營銷處","台中營銷處","台中","DEALER_TT","DCS_TT","TW002194001B",190292,"台中營銷處"]
["TW002201001B","中聯發國際企業有限公司","TW002201","16402395","台中營銷處","台中營銷處","台中","DEALER_TT","DLC_TT","TW002201001B",76555,"台中營銷處"]
["TW002204001B","鑫昌電器有限公司","22789515","22791019","台中營銷處","台中營銷處","台中","DEALER_TT","SPD_TT","TW002204001B",null,"台中營銷處"]
["TW002206001B","祥峰電器行","TW002206","61841075","台中營銷處","台中營銷處","台中","DEALER_TT","DLC_TT","TW002206001B",0,"台中營銷處"]
["TW002214001B","欣益電器行","TW002214","12043905","台中營銷處","台中營銷處","台中","DEALER_TT","SPD_TT","TW002214001B",345944,"台中營銷處"]
["TW002223001B","長紅電子專賣店","19680422","92812618","台中營銷處","台中營銷處","台中","DEALER_TT","DLC_TT","TW002223001B",0,"台中營銷處"]
["TW002228001B","嘉聲電器有限公司","TW002228","22960798","台中營銷處","台中營銷處","台中","DEALER_TT","DLC_TT"]
["TW002229001B","宏昌電器行","19590618","24151920","台中營銷處","台中營銷處","台中","DEALER_TT","DLC_TT","TW002229001B",146816,"台中營銷處"]
["TW002239001B","明信電子專賣店","19641206","77109680","台中營銷處","台中營銷處","台中","DEALER_TT","DLC_TT","TW002239001B",53491,"台中營銷處"]
["TW002245001B","明嘉電器","TW002245","23077347","台中營銷處","台中營銷處","台中","DEALER_TT","DLC_TT"]
["TW002248001B","盟音電器","TW002248","84181461","台中營銷處","台中營銷處","台中","DEALER_TT","DLC_TT"]
["TW002250001B","格愛陞有限公司","TW002250","84694814","台中營銷處","台中營銷處","台中","DEALER_TT","DCS_TT"]
["TW002252001B","沅富電器行","19611227","18334578","台中營銷處","台中營銷處","台中","DEALER_TT","SPD_TT","TW002252001B",171368,"台中營銷處"]
["TW002257001B","恆信電器有限公司","TW002257","89817694","台中營銷處","台中營銷處","台中","DEALER_TT","DCS_TT","TW002257001B",17010,"台中營銷處"]
["TW002261001B","美齊富有限公司","23893338","23811788","台中營銷處","台中營銷處","台中","DEALER_TT","DLC_TT","TW002261001B",75258,"台中營銷處"]
["TW002261002B","美齊富有限公司","XXXXXXXX","XXXXXXXX","ID/SAC Sales","ID/SAC Sales","ID & SAC","B2B_TT","CAC_TT"]
["TW002262001B","太子電業行","TW002262","77685331","台中營銷處","台中營銷處","台中","DEALER_TT","DCS_TT","TW002262001B",715616,"台中營銷處"]
["TW002265001B","大謄電器有限公司","TW002265","22915458","台中營銷處","台中營銷處","台中","DEALER_TT","DCS_TT","TW002265001B",210615,"台中營銷處"]
["TW002267001B","東林電器有限公司","19531101","97482257","台中營銷處","台中營銷處","台中","DEALER_TT","DLC_TT","TW002267001B",0,"台中營銷處"]
["TW002268001B","佳億電器量販","TW002268","77249459","台中營銷處","台中營銷處","台中","DEALER_TT","DLC_TT"]
["TW002277001B","家晟電器","TW002277","22401937","台中營銷處","台中營銷處","台中","DEALER_TT","DLC_TT"]
["TW002288001B","幸韻電器有限公司","19661201","89328106","桃竹營銷處","桃竹營銷處","桃竹","DEALER_TT","SPD_TT","TW002288001B",1285216,"桃竹營銷處"]
["TW002291001B","金一電器有限公司","19570623","22137992","桃竹營銷處","桃竹營銷處","桃竹","DEALER_TT","SPD_TT","TW002291001B",1167079,"桃竹營銷處"]
["TW002295001B","金昇電器有限公司","19691111","49651654","桃竹營銷處","桃竹營銷處","桃竹","DEALER_TT","DLC_TT"]
["TW002305001B","皇典電器行","19680201","78544155","桃竹營銷處","桃竹營銷處","桃竹","DEALER_TT","DCS_TT","TW002305001B",429260,"桃竹營銷處"]
["TW002315001B","銓日電器行","19670416","73800090","桃竹營銷處","桃竹營銷處","桃竹","DEALER_TT","DLC_TT",null,0,"桃竹營銷處"]
["TW002324001B","兆宏電業行","19640130","47039765","桃竹營銷處","桃竹營銷處","桃竹","DEALER_TT","DCS_TT","TW002324001B",212339,"桃竹營銷處"]
["TW002331001B","同慶電氣行","19530412","43779752","桃竹營銷處","桃竹營銷處","桃竹","DEALER_TT","DCS_TT","TW002331001B",107705,"桃竹營銷處"]
["TW002338001B","福娥電業行","19580811","13513828","桃竹營銷處","桃竹營銷處","桃竹","DEALER_TT","DCS_TT","TW002338001B",75332,"桃竹營銷處"]
["TW002343001B","名富電器行","19500615","45162367","桃竹營銷處","桃竹營銷處","桃竹","DEALER_TT","DLC_TT","TW002343001B",171904,"桃竹營銷處"]
["TW002347001B","得興電器有限公司","19690802","89730711","桃竹營銷處","桃竹營銷處","桃竹","DEALER_TT","DLC_TT","TW002347001B",1894840,"桃竹營銷處"]
["TW002349001B","金長益電器有限公司","19640714","16908253","桃竹營銷處","桃竹營銷處","桃竹","DEALER_TT","DLC_TT","TW002349001B",1641237,"桃竹營銷處"]
["TW002351001B","雅光有限公司","19590805","01189353","台北營銷處","台北營銷處","台北","DEALER_TT","SPD_TT","TW002351001B",4036296,"台北營銷處"]
["TW002351002B","雅光有限公司","XXXXXXXX","XXXXXXXX","ID/SAC Sales","ID/SAC Sales","ID & SAC","B2B_TT","CAC_TT"]
["TW002352001B","佳禾貿易有限公司","19501112","97310065","台北營銷處","台北營銷處","台北","DEALER_TT","DCS_TT","TW002352001B",85943,"台北營銷處"]
["TW002359001B","宏仁電器行","19690518","92883893","台北營銷處","台北營銷處","台北","DEALER_TT","DCS_TT","TW002359001B",16916,"台北營銷處"]
["TW002363001B","吳頡興電器企業有限公司","19551115","22905634","台北營銷處","台北營銷處","台北","DEALER_TT","DCS_TT","TW002363001B",18968,"台北營銷處"]
["TW002368001B","健融電器行","19590810","02153403","台北營銷處","台北營銷處","台北","DEALER_TT","DCS_TT","TW002368001B",null,"台北營銷處"]
["TW002372001B","承德國際有限公司","19661020","89960924","台北營銷處","台北營銷處","台北","DEALER_TT","DCS_TT","TW002372001B",1550328,"台北營銷處"]
["TW002375001B","建而福電器有限公司","19470824","33842192","台北營銷處","台北營銷處","台北","DEALER_TT","DLC_TT","TW002375001B",null,"台北營銷處"]
["TW002376001B","新弘貿易有限公司","19590115","23004274","台北營銷處","台北營銷處","台北","DEALER_TT","SPD_TT","TW002376001B",1197145,"台北營銷處"]
["TW002378001B","上順電器有限公司","19550916","23815317","台北營銷處","台北營銷處","台北","DEALER_TT","DCS_TT","TW002378001B",450264,"台北營銷處"]
["TW002381001B","萬豐視聽電業有限公司","19620320","22592990","台北營銷處","台北營銷處","台北","DEALER_TT","DCS_TT","TW002381001B",1908437,"台北營銷處"]
["TW002382001B","訊立電器有限公司","19560601","12710694","台北營銷處","台北營銷處","台北","DEALER_TT","DLC_TT","TW002382001B",null,"台北營銷處"]
["TW002387001B","鎮吉實業","19651125","70662642","台北營銷處","台北營銷處","台北","DEALER_TT","DCS_TT"]
["TW002391001B","益大家電事業有限公司","24239141","22573614","台北營銷處","台北營銷處","台北","DEALER_TT","DCS_TT","TW002391001B",79781,"台北營銷處"]
["TW002398001B","彥昌電器行","26416154","02300192","台北營銷處","台北營銷處","台北","DEALER_TT","DLC_TT","TW002398001B",null,"台北營銷處"]
["TW002400001B","金亞實業有限公司","26473088","89230504","台北營銷處","台北營銷處","台北","DEALER_TT","DCS_TT","TW002400001B",4498254,"台北營銷處"]
["TW002409001B","太空電器行","19551106","77300011","高屏營銷處","高屏營銷處","高屏","DEALER_TT","DLC_TT","TW002409001B",210,"高屏營銷處"]
["TW002409002B","太空電器行","XXXXXXXX","XXXXXXXX","ID/SAC Sales","ID/SAC Sales","ID & SAC","B2B_TT","CAC_TT"]
["TW002410001B","全新電器有限公司","19510722","20760963","台北營銷處","台北營銷處","台北","DEALER_TT","DLC_TT"]
["TW002411001B","金門電器行","19530605","77265149","高屏營銷處","高屏營銷處","高屏","DEALER_TT","DCS_TT","TW002411001B",825940,"高屏營銷處"]
["TW002416001B","國寶電業行","19680525","12180750","台北營銷處","台北營銷處","台北","DEALER_TT","DLC_TT","TW002416001B",null,"台北營銷處"]
["TW002420001B","高登電器有限公司","19551029","22629645","台北營銷處","台北營銷處","台北","DEALER_TT","SPD_TT","TW002420001B",151043,"台北營銷處"]
["TW002427001B","國豐電業商行","19551014","94836355","台北營銷處","台北營銷處","台北","DEALER_TT","DLC_TT","TW002427001B",null,"台北營銷處"]
["TW002428001B","精實電器行","19740715","64803602","台北營銷處","台北營銷處","台北","DEALER_TT","DCS_TT","TW002428001B",0,"台北營銷處"]
["TW002431001B","一世代電氣行","19620315","18063076","台北營銷處","台北營銷處","台北","DEALER_TT","DLC_TT","TW002431001B",303200,"台北營銷處"]
["TW002434001B","上將電業社","19550423","92933057","台北營銷處","台北營銷處","台北","DEALER_TT","DLC_TT","TW002434001B",109909,"台北營銷處"]
["TW002441001B","上揚電器行","19660523","02418034","台北營銷處","台北營銷處","台北","DEALER_TT","DCS_TT","TW002441001B",34872,"台北營銷處"]
["TW002444001B","台灣電器專賣店","19700805","98077164","台北營銷處","台北營銷處","台北","DEALER_TT","DCS_TT","TW002444001B",69792,"台北營銷處"]
["TW002448001B","宜勇電器","19631117","66256925","台北營銷處","台北營銷處","台北","DEALER_TT","DLC_TT"]
["TW002450001B","日大電業行","19770914","40523763","台北營銷處","台北營銷處","台北","DEALER_TT","DCS_TT","TW002450001B",0,"台北營銷處"]
["TW002456001B","燦坤實業股份有限公司","69568009","69568009","MMCS-燦坤","燦坤","MMCS","MMCS_TK3C","CSC_TT","TW002456001B",185804845,"燦坤"]
["TW002501001B","家福股份有限公司總公司","22662550","22662550","MMCS-家福","家樂福","MMCS","MMCS_C4","MMC_TT","TW002501001B",218323013,"家樂福 "]
["TW002514001B","今漢電器有限公司","19591213","22117460","台北營銷處","台北營銷處","台北","DEALER_TT","SPD_TT","TW002514001B",2744696,"台北營銷處"]
["TW002516001B","順寶電器","19520904","34159393","台北營銷處","台北營銷處","台北","DEALER_TT","DLC_TT"]
["TW002525001B","大潤發流通事業股份有限公司","97165560","97165560","MMCS-大潤發","大潤發","MMCS","MMCS_RT","MMC_TT","TW002525001B",161560817,"大潤發"]
["TW002529001B","遠百企業股份有限公司","05714195","05714195","MMCS-愛買","愛買","MMCS","MMCS_OTHERS","MMC_TT","TW002529001B",22791635,"愛買"]
["TW002535001B","瑞豪電器行","19711205","67899377","台北營銷處","台北營銷處","台北","DEALER_TT","DLC_TT","TW002535001B",null,"台北營銷處"]
["TW002542001B","佳麗寶股份有限公司","19470128","04897247","台北營銷處","台北營銷處","台北","DEALER_TT","DCS_TT"]
["TW002557001B","全民電子音響專賣店","TW002557","77593945","台中營銷處","台中營銷處","台中","DEALER_TT","SPD_TT","TW002557001B",1429956,"台中營銷處"]
["TW002572001B","新傑電器有限公司","19540819","12749635","高屏營銷處","高屏營銷處","高屏","DEALER_TT","SPD_TT","TW002572001B",1187253,"高屏營銷處"]
["TW002575001B","東欣電器商行","19510527","08001827","高屏營銷處","高屏營銷處","高屏","DEALER_TT","DCS_TT","TW002575001B",61133,"高屏營銷處"]
["TW002630001B","錦穗實業社","19571107","73713103","嘉南營銷處","嘉南營銷處","嘉南","DEALER_TT","DCS_TT","TW002630001B",136232,"嘉南營銷處"]
["TW002652001B","第二電器音響有限公司","19600410","33837276","台北營銷處","台北營銷處","台北","DEALER_TT","DCS_TT","TW002652001B",1464109,"台北營銷處"]
["TW002666001B","世和電器行","19661031","87705862","桃竹營銷處","桃竹營銷處","桃竹","DEALER_TT","DLC_TT"]
["TW002666002B","世和電器行","19661031","87705862","ETC","ETC","ETC","ETC","ETC_TT","TW002666002B",34385,"ETC"]
["TW002674001B","明聳企業有限公司","XXXXXXXX","XXXXXXXX","ID/SAC Sales","ID/SAC Sales","ID & SAC","B2B_TT","CAC_TT"]
["TW002675001B","利聲家電有限公司","19470925","86101317","嘉南營銷處","嘉南營銷處","嘉南","DEALER_TT","DCS_TT","TW002675001B",109150,"嘉南營銷處"]
["TW002677001B","銘山電器","23393762","23328168","台中營銷處","台中營銷處","台中","DEALER_TT","DLC_TT"]
["TW002678001B","昇泰電業行","TW002678","05830687","台中營銷處","台中營銷處","台中","DEALER_TT","DLC_TT"]
["TW002685001B","威揚電器行","19690225","17276277","台北營銷處","台北營銷處","台北","DEALER_TT","SPD_TT","TW002685001B",343182,"台北營銷處"]
["TW002710001B","建利電子音響","19580810","18324380","台中營銷處","台中營銷處","台中","DEALER_TT","DLC_TT"]
["TW002718001B","全國電子股份有限公司","22006252","22006252","MMCS-全國","全國","MMCS","MMCS_E-LIFE","CSC_TT","TW002718001B",316177599,"全國  "]
["TW002720001B","天聲電器商行","19540401","98249862","桃竹營銷處","桃竹營銷處","桃竹","DEALER_TT","DLC_TT","TW002720001B",0,"桃竹營銷處"]
["TW002721001B","統偉視聽工程有限公司","19591014","22669408","桃竹營銷處","桃竹營銷處","桃竹","DEALER_TT","DCS_TT","TW002721001B",198235,"桃竹營銷處"]
["TW002725001B","侑興電器有限公司","TW002725","22682057","台中營銷處","台中營銷處","台中","DEALER_TT","DLC_TT","TW002725001B",null,"台中營銷處"]
["TW002725002B","侑興電器有限公司","XXXXXXXX","XXXXXXXX","ID/SAC Sales","ID/SAC Sales","ID & SAC","B2B_TT","CAC_TT","TW002725002B"]
["TW002745001B","全英電器有限公司","19530909","30976506","台北營銷處","台北營銷處","台北","DEALER_TT","DCS_TT","TW002745001B",0,"台北營銷處"]
["TW002748001B","創作電子音響專賣店","TW002748","81964433","台中營銷處","台中營銷處","台中","DEALER_TT","SPD_TT","TW002748001B",285047,"台中營銷處"]
["TW002750001B","集雅社股份有限公司","89266170","89266170","HPC","百貨","百貨","DEALER_DEPT","DEALER_DEPT","TW002750001B",74355396,"百貨"]
["TW002755001B","聯鈦冷凍空調電器行","19660924","14156334","嘉南營銷處","嘉南營銷處","嘉南","DEALER_TT","DCS_TT","TW002755001B",322518,"嘉南營銷處"]
["TW002757001B","慧聲電器行","19601115","78215533","台北營銷處","台北營銷處","台北","DEALER_TT","SPD_TT","TW002757001B",0,"台北營銷處"]
["TW002758001B","秀翔實業有限公司","89429694","89429694","HPC","百貨","百貨","DEALER_DEPT","DEALER_DEPT","TW002758001B",8267152,"百貨"]
["TW002761001B","憶豐電器有限公司","19670109","47109086","桃竹營銷處","桃竹營銷處","桃竹","DEALER_TT","DCS_TT","TW002761001B",173938,"桃竹營銷處"]
["TW002762001B","員毅電器有限公司","TW002762","16929102","台中營銷處","台中營銷處","台中","DEALER_TT","DLC_TT","TW002762001B",34872,"台中營銷處"]
["TW002764001B","弘象電器有限公司","19670507","97316526","台北營銷處","台北營銷處","台北","DEALER_TT","SPD_TT","TW002764001B",26346,"台北營銷處"]
["TW002769001B","東農電器行","19611101","78766509","高屏營銷處","高屏營銷處","高屏","DEALER_TT","SPD_TT","TW002769001B",1099607,"高屏營銷處"]
["TW002769002B","東農電器行","XXXXXXXX","XXXXXXXX","ID/SAC Sales","ID/SAC Sales","ID & SAC","B2B_TT","CAC_TT"]
["TW002780001B","金銓電器行","TW002780","13759385","台中營銷處","台中營銷處","台中","DEALER_TT","DCS_TT","TW002780001B",123946,"台中營銷處"]
["TW002789001B","宏昇電器行","19671229","97842555","台中營銷處","台中營銷處","台中","DEALER_TT","SPD_TT","TW002789001B",454883,"台中營銷處"]
["TW002801001B","銘信視聽電器城","19710720","92811337","台中營銷處","台中營銷處","台中","DEALER_TT","DLC_TT","TW002801001B",0,"台中營銷處"]
["TW002811001B","棋杰電器行","19650706","08016878","高屏營銷處","高屏營銷處","高屏","DEALER_TT","SPD_TT","TW002811001B",1348292,"高屏營銷處"]
["TW002843001B","吉田電器行","19620111","17683437","桃竹營銷處","桃竹營銷處","桃竹","DEALER_TT","DCS_TT","TW002843001B",104652,"桃竹營銷處"]
["TW002851001B","隆慶電器行","47374042","47374803","台中營銷處","台中營銷處","台中","DEALER_TT","SPD_TT","TW002851001B",2288295,"台中營銷處"]
["TW002856001B","老雙億實業有限公司","19490915","35957606","台北營銷處","台北營銷處","台北","DEALER_TT","DCS_TT","TW002856001B",362839,"台北營銷處"]
["TW002858001B","豐昌電器行","19630721","06565736","嘉南營銷處","嘉南營銷處","嘉南","DEALER_TT","DCS_TT","TW002858001B",54528,"嘉南營銷處"]
["TW002861001B","昇廣電器有限公司","19611020","16498693","台中營銷處","台中營銷處","台中","DEALER_TT","DLC_TT","TW002861001B",142024,"台中營銷處"]
["TW002870001B","松立電業社","19560806","90720487","高屏營銷處","高屏營銷處","高屏","DEALER_TT","DLC_TT","TW002870001B",88203,"高屏營銷處"]
["TW002886001B","三信電氣行","19570402","08359830","台中營銷處","台中營銷處","台中","DEALER_TT","SPD_TT","TW002886001B",2074947,"台中營銷處"]
["TW002887001B","仙風電器有限公司","XXXXXXXX","XXXXXXXX","桃竹營銷處","桃竹營銷處","桃竹","DEALER_TT","DCS_TT","TW002887001B",170208,"桃竹營銷處"]
["TW002896001B","三星電器行","19670620","59096683","台中營銷處","台中營銷處","台中","DEALER_TT","DCS_TT","TW002896001B",99663,"台中營銷處"]
["TW002897001B","南山電器行","19700420","17925152","台北營銷處","台北營銷處","台北","DEALER_TT","DLC_TT"]
["TW002904001B","天烽電器有限公司","19711108","80272502","台北營銷處","台北營銷處","台北","DEALER_TT","SPD_TT","TW002904001B",91092,"台北營銷處"]
["TW002919001B","建鑫電器行","19721112","18282184","嘉南營銷處","嘉南營銷處","嘉南","DEALER_TT","DCS_TT","TW002919001B",0,"嘉南營銷處"]
["TW002927001B","中信冷凍電器行","19710227","19801699","高屏營銷處","高屏營銷處","高屏","DEALER_TT","DCS_TT","TW002927001B",675748,"高屏營銷處"]
["TW002945001B","勁鋒電器行","19641113","87753771","高屏營銷處","高屏營銷處","高屏","DEALER_TT","DLC_TT","TW002945001B",0,"高屏營銷處"]
["TW002946001B","佑均電器商行","19800403","98119827","桃竹營銷處","桃竹營銷處","桃竹","DEALER_TT","DLC_TT","TW002946001B"]
["TW002950001B","廣昌電器行","TW002950","97885688","台中營銷處","台中營銷處","台中","DEALER_TT","SPD_TT","TW002950001B",531764,"台中營銷處"]
["TW002952001B","廣駿電器行","24925933","24921827","台中營銷處","台中營銷處","台中","DEALER_TT","DCS_TT","TW002952001B",237567,"台中營銷處"]
["TW002960001B","正賢電器行","TW002960","84042476","台中營銷處","台中營銷處","台中","DEALER_TT","DCS_TT","TW002960001B",25760,"台中營銷處"]
["TW002964001B","台灣樂金顯示科技股份有限公司","XXXXXXXX","XXXXXXXX","台北營銷處","台北營銷處","台北","ETC","ETC_TT"]
["TW002965001B","永定電器有限公司","19781001","96857734","高屏營銷處","高屏營銷處","高屏","DEALER_TT","DCS_TT","TW002965001B",157895,"高屏營銷處"]
["TW002975001B","佳美電器行","19550202","06644845","嘉南營銷處","嘉南營銷處","嘉南","DEALER_TT","DLC_TT"]
["TW002978001B","匯豐家電有限公司","23383896","23366784","台中營銷處","台中營銷處","台中","DEALER_TT","DLC_TT","TW002978001B",null,"台中營銷處"]
["TW002989001B","隆松電器有限公司","36663666","69845546","嘉南營銷處","嘉南營銷處","嘉南","DEALER_TT","DCS_TT","TW002989001B",0,"嘉南營銷處"]
["TW002990001B","國際水電冷氣工程行","19651008","49776492","桃竹營銷處","桃竹營銷處","桃竹","DEALER_TT","DLC_TT",null,304264,"桃竹營銷處"]
["TW002991001B","偉誠電器","19740120","96888413","台北營銷處","台北營銷處","台北","DEALER_TT","DLC_TT"]
["TW002997001B","鎰銘電器有限公司","19670216","80103181","台北營銷處","台北營銷處","台北","DEALER_TT","SPD_TT","TW002997001B",3098574,"台北營銷處"]
["TW003001001B","銘盛電器有限公司","19560401","97184980","台北營銷處","台北營銷處","台北","DEALER_TT","DLC_TT","TW003001001B",null,"台北營銷處"]
["TW003013001B","重慶國際有限公司","TW003013","79955373","台中營銷處","台中營銷處","台中","DEALER_TT","DCS_TT","TW003013001B",228877,"台中營銷處"]
["TW003020002B","華笙音響企業有限公司","TW003020","23688754","台中營銷處","台中營銷處","台中","DEALER_TT","DLC_TT","TW003020002B",19525,"台中營銷處"]
["TW003023001B","翠亨企業股份有限公司","19820909","16129431","高屏營銷處","高屏營銷處","高屏","DEALER_TT","DCS_TT","TW003023001B",808903,"高屏營銷處"]
["TW003029001B","大統電器行","19581106","02846102","桃竹營銷處","桃竹營銷處","桃竹","DEALER_TT","DCS_TT","TW003029001B",262679,"桃竹營銷處"]
["TW003034001B","九瑜電氣行","TW003034","97887216","台中營銷處","台中營銷處","台中","DEALER_TT","DLC_TT","TW003034001B",null,"台中營銷處"]
["TW003035001B","友信電器有限公司","19571230","97341659","嘉南營銷處","嘉南營銷處","嘉南","DEALER_TT","DLC_TT","TW003035001B",0,"嘉南營銷處"]
["TW003040001B","悅鼎電器有限公司","19690102","84693028","台北營銷處","台北營銷處","台北","DEALER_TT","SPD_TT","TW003040001B",4837394,"台北營銷處"]
["TW003052001B","蓁筳園企業有限公司","XXXXXXXX","XXXXXXXX","ID Sales","ID Sales","ID Sales"]
["TW003052002B","蓁筳園企業有限公司","XXXXXXXX","XXXXXXXX","ID/SAC Sales","ID/SAC Sales","ID & SAC","B2B_TT","CAC_TT"]
["TW003053001B","尚德師企業有限公司","19630211","12933843","台北營銷處","台北營銷處","台北","DEALER_TT","DLC_TT","TW003053001B",184760,"台北營銷處"]
["TW003054001B","上益","19550615","15719466","嘉南營銷處","嘉南營銷處","嘉南","DEALER_TT","DLC_TT"]
["TW003071001B","泰昀企業有限公司","19490915","22866800","台北營銷處","台北營銷處","台北","DEALER_TT","SPD_TT","TW003071001B",3852780,"台北營銷處"]
["TW003094001B","大銀幕視聽音響有限公司","TW003094","97033415","台中營銷處","台中營銷處","台中","DEALER_TT","DCS_TT","TW003094001B",1053813,"台中營銷處"]
["TW003096001B","極品家電","47226905","47293663","台中營銷處","台中營銷處","台中","DEALER_TT","DCS_TT"]
["TW003125001B","宏暉電器行","19730421","14194891","高屏營銷處","高屏營銷處","高屏","DEALER_TT","DLC_TT","TW003125001B",0,"高屏營銷處"]
["TW003126001B","東圓電器行","19811028","19656246","桃竹營銷處","桃竹營銷處","桃竹","DEALER_TT","SPD_TT","TW003126001B",0,"桃竹營銷處"]
["TW003127001B","富盟企業社","TW003127","13400211","台中營銷處","台中營銷處","台中","DEALER_TT","DCS_TT","TW003127001B",206015,"台中營銷處"]
["TW003130001B","展碁國際股份有限公司","20773257","20773257","HPC","IT","IT","IT_TT","IT_TT","TW003130001B",52475376,"IT"]
["TW003130002B","展碁國際股份有限公司","20773257","20773257","ID Sales","ID Sales","ID Sales",null,null,"TW003130002B",347550,"ID Sales Team"]
["TW003130004B","展碁國際股份有限公司","20773257","20773257","台北營銷處","台北營銷處","台北","DEALER_TT","DLC_TT",null,5258841]
["TW003134001B","鴻輝電器有限公司","19621230","23548071","台北營銷處","台北營銷處","台北","DEALER_TT","DCS_TT","TW003134001B",764414,"台北營銷處"]
["TW003145001B","京享企業行","19601212","12084709","高屏營銷處","高屏營銷處","高屏","DEALER_TT","DLC_TT","TW003145001B"]
["TW003168001B","名揚家電行","19630801","17157223","嘉南營銷處","嘉南營銷處","嘉南","DEALER_TT","DLC_TT"]
["TW003169001B","欣益大企業有限公司","19530717","97413816","嘉南營銷處","嘉南營銷處","嘉南","DEALER_TT","DCS_TT","TW003169001B",64243,"嘉南營銷處"]
["TW003173001B","弘侖電業有限公司","19670219","16187086","桃竹營銷處","桃竹營銷處","桃竹","DEALER_TT","DCS_TT","TW003173001B",0,"桃竹營銷處"]
["TW003180001B","翔韻電器有限公司","19551220","84143312","台北營銷處","台北營銷處","台北","DEALER_TT","DCS_TT","TW003180001B",204454,"台北營銷處"]
["TW003181001B","神腦國際企業股份有限公司","19520206","12228473","行動電話","行動電話","行動電話","GSM_TT","GSM_TT","TW003181001B",9932809,"行動電話 "]
["TW003181002B","神腦","22183588","22183588","行動電話","行動電話","行動電話","GSM_TT","GSM_TT"]
["TW003182001B","聯強國際股份有限公司","19561203","23060541","行動電話","行動電話","行動電話","GSM_TT","GSM_TT","TW003182001B",null,"行動電話 "]
["TW003182002B","聯強國際股份有限公司","XXXXXXXX","XXXXXXXX","ID Sales","ID Sales","ID Sales",null,null,"TW003182002B",22360569,"ID Sales Team"]
["TW003184001B","全虹企業股份有限公司","77235848","77235978","行動電話","行動電話","行動電話","GSM_TT","GSM_TT"]
["TW003190001B","天竺國音響精品館","TW003190","78154803","台中營銷處","台中營銷處","台中","DEALER_TT","DCS_TT","TW003190001B",0,"台中營銷處"]
["TW003191001B","旭聲電器行","19681117","87935668","桃竹營銷處","桃竹營銷處","桃竹","DEALER_TT","DLC_TT","TW003191001B",null,"桃竹營銷處"]
["TW003193001B","秀明電器行","19520402","57515611","台中營銷處","台中營銷處","台中","DEALER_TT","DLC_TT"]
["TW003222001B","明泰電器行","19510601","44971242","桃竹營銷處","桃竹營銷處","桃竹","DEALER_TT","DCS_TT","TW003222001B",126995,"桃竹營銷處"]
["TW003229001B","福昱電器有限公司","19570124","12737244","台中營銷處","台中營銷處","台中","DEALER_TT","DLC_TT","TW003229001B",0,"台中營銷處"]
["TW003234001B","九龍電器行","19600910","06193052","嘉南營銷處","嘉南營銷處","嘉南","DEALER_TT","DCS_TT","TW003234001B",219333,"嘉南營銷處"]
["TW003260001B","昇汶有限公司","TW003260","80440607","台中營銷處","台中營銷處","台中","DEALER_TT","DCS_TT","TW003260001B",null,"台中營銷處"]
["TW003310001B","陽曜企業有限公司","19620616","86387164","桃竹營銷處","桃竹營銷處","桃竹","DEALER_TT","SPD_TT","TW003310001B",3076771,"桃竹營銷處"]
["TW003312001B","小揚家電","19711028","37912900","台北營銷處","台北營銷處","台北","DEALER_TT","SPD_TT"]
["TW003330001B","吉隆電器行","19590128","78305128","台北營銷處","台北營銷處","台北","DEALER_TT","DLC_TT","TW003330001B",0,"台北營銷處"]
["TW003333001B","俊昇電器行","19710828","13899479","高屏營銷處","高屏營銷處","高屏","DEALER_TT","DLC_TT"]
["TW003350001B","鴻豪電器企業有限公司","19810327","16557664","台北營銷處","台北營銷處","台北","DEALER_TT","DCS_TT"]
["TW003353001B","弦有電器行","19600520","06184357","嘉南營銷處","嘉南營銷處","嘉南","DEALER_TT","DCS_TT","TW003353001B",151281,"嘉南營銷處"]
["TW003366001B","音匠音響實業社","19660428","92924085","台北營銷處","台北營銷處","台北","DEALER_TT","DLC_TT"]
["TW003368001B","菖泰電機有限公司","19730620","47321806","桃竹營銷處","桃竹營銷處","桃竹","DEALER_TT","SPD_TT","TW003368001B",864896,"桃竹營銷處"]
["TW003368002B","菖泰電機有限公司","19730620","47321806","SAC Sales","SAC Sales","SAC Sales","B2B_TT","CAC_TT","TW003368002B",null,"SAC sales Team"]
["TW003375001B","力洋國際電器有限公司","19530705","13054751","桃竹營銷處","桃竹營銷處","桃竹","DEALER_TT","DLC_TT","TW003375001B",null,"桃竹營銷處"]
["TW003378001B","捷元股份有限公司","23134543","23134543","HPC","IT","IT","IT_TT","IT_TT","TW003378001B",2667209,"IT"]
["TW003378002B","捷元股份有限公司","XXXXXXXX","XXXXXXXX","B2B2C","B2B2C","B2B2C","B2B_TT","B2B_TT","TW003378003B",7511438,"B2B2C(B2B2C Part)"]
["TW003378003B","捷元股份有限公司","XXXXXXXX","XXXXXXXX","ID Sales","ID Sales","ID Sales",null,null,"TW003378003B",null,"ID Sales Team"]
["TW003389001B","金樹電器空調有限公司","19610105","80572493","嘉南營銷處","嘉南營銷處","嘉南","DEALER_TT","SPD_TT","TW003389001B",2295938,"嘉南營銷處"]
["TW003396001B","亨達電器行","19680131","17943216","台北營銷處","台北營銷處","台北","DEALER_TT","DLC_TT","TW003396001B",null,"台北營銷處"]
["TW003406001B","立交實業有限公司","TW003406","55998844","台中營銷處","台中營銷處","台中","DEALER_TT","DCS_TT","TW003406001B",227120,"台中營銷處"]
["TW003408001B","景新電器","19630914","22672115","台北營銷處","台北營銷處","台北","DEALER_TT","DLC_TT"]
["TW003422001B","正昇電器行","19791027","02490123","桃竹營銷處","桃竹營銷處","桃竹","DEALER_TT","DLC_TT","TW003422001B",18619,"桃竹營銷處"]
["TW003437001B","宥騰機電有限公司","XXXXXXXX","XXXXXXXX","ID/SAC Sales","ID/SAC Sales","ID & SAC","B2B_TT","CAC_TT"]
["TW003438001B","新各界企業","12402015","12402015","HPC","百貨","百貨","DEALER_DEPT","DEALER_DEPT","TW003438001B",1048830,"百貨"]
["TW003445001B","龍城商行","TW003445","02992131","台中營銷處","台中營銷處","台中","DEALER_TT","DLC_TT","TW003445001B",0,"台中營銷處"]
["TW003455001B","六福開發股份有限公司南京分公司","XXXXXXXX","XXXXXXXX","台北營銷處","台北營銷處","台北","DEALER_TT","B2B_TT"]
["TW003462001B","大成生活家電行","19730625","99250795","高屏營銷處","高屏營銷處","高屏","DEALER_TT","DLC_TT","TW003462001B",59492,"高屏營銷處"]
["TW003486001B","正一企業股份有限公司","XXXXXXXX","XXXXXXXX","ID/SAC Sales","ID/SAC Sales","ID & SAC","B2B_TT","CAC_TT"]
["TW003487001B","強華電器企業有限公司","19741010","84529147","台北營銷處","台北營銷處","台北","DEALER_TT","DCS_TT","TW003487001B",32841,"台北營銷處"]
["TW003488001B","得利購企業社","19740217","99432579","台北營銷處","台北營銷處","台北","DEALER_TT","DCS_TT","TW003488001B",0,"台北營銷處"]
["TW003518001B","鴻韻音響","19650602","02776458","桃竹營銷處","桃竹營銷處","桃竹","DEALER_TT","DLC_TT","TW003518001B",0,"桃竹營銷處"]
["TW003547001B","世貿電器行","19630526","36415209","桃竹營銷處","桃竹營銷處","桃竹","DEALER_TT","DCS_TT","TW003547001B",261567,"桃竹營銷處"]
["TW003573001B","泰宜電器行","19591001","77130305","台北營銷處","台北營銷處","台北","DEALER_TT","DCS_TT","TW003573001B",0,"台北營銷處"]
["TW003605001B","台灣樂金化學股份有限公司","XXXXXXXX","XXXXXXXX","台北營銷處","台北營銷處","台北","ETC","ETC_TT"]
["TW003647001B","平源音響","TW003647","13816338","台中營銷處","台中營銷處","台中","DEALER_TT","DLC_TT"]
["TW003661001B","桃竹苗電器有限公司","19600806","89527766","桃竹營銷處","桃竹營銷處","桃竹","DEALER_TT","DCS_TT","TW003661001B",192178,"桃竹營銷處"]
["TW003677001B","昌明視聽科技","19631218","80525197","台北營銷處","台北營銷處","台北","DEALER_TT","DLC_TT"]
["TW003680001B","東禾一家電有限公司","19640120","16250691","桃竹營銷處","桃竹營銷處","桃竹","DEALER_TT","DLC_TT","TW003680001B",615156,"桃竹營銷處"]
["TW003688001B","東虹電器行","TW003688","77387776","台中營銷處","台中營銷處","台中","DEALER_TT","DLC_TT","TW003688001B",null,"台中營銷處"]
["TW003703001B","大潤發流通事業股份有限公司台南分公司","97165560","97165560","MMCS-大潤發","大潤發","MMCS","MMCS_RT","MMC_TT","TW003703001B",126182,"大潤發"]
["TW003705001B","大潤發流通事業股份有限公司安平分公司","97165560","97165560","MMCS-大潤發","大潤發","MMCS","MMCS_RT","MMC_TT"]
["TW003706001B","大潤發流通事業股份有限公司忠孝分公司","97165560","97165560","MMCS-大潤發","大潤發","MMCS","MMCS_RT","MMC_TT","TW003706001B",null,"大潤發"]
["TW003713001B","大潤發流通事業股份有限公司台南佳里店分公司","97165560","97165560","MMCS-大潤發","大潤發","MMCS","MMCS_RT","MMC_TT","TW003713001B",16110,"大潤發"]
["TW003728001B","中樂電器有限公司","19690224","97487963","桃竹營銷處","桃竹營銷處","桃竹","DEALER_TT","DCS_TT","TW003728001B",20190,"桃竹營銷處"]
["TW003747001B","中特企業社","TW003747","99919468","台中營銷處","台中營銷處","台中","DEALER_TT","DLC_TT"]
["TW003752001B","高盛電器行","19780712","80811451","台中營銷處","台中營銷處","台中","DEALER_TT","DLC_TT"]
["TW003757002B","愛樂音響社","19681208","98066785","嘉南營銷處","嘉南營銷處","嘉南","DEALER_TT","DLC_TT"]
["TW003760001B","德豐電器行","19680706","98872660","嘉南營銷處","嘉南營銷處","嘉南","DEALER_TT","SPD_TT","TW003760001B",3589783,"嘉南營銷處"]
["TW003771001B","鑫沅電企業有限公司","19730430","12804566","台北營銷處","台北營銷處","台北","DEALER_TT","DLC_TT","TW003771001B",null,"台北營銷處"]
["TW003790001B","潤泰創新國際股份有限公司中崙分公司","97165560","97165560","MMCS-大潤發","大潤發","MMCS","MMCS_RT","MMC_TT","TW003790001B",null,"大潤發"]
["TW003793001B","大潤發流通事業股份有限公司台東分公司","97165560","97165560","MMCS-大潤發","大潤發","MMCS","MMCS_RT","MMC_TT","TW003793001B",null,"大潤發"]
["TW003805001B","上加電器有限公司","TW003805","80604018","台中營銷處","台中營銷處","台中","DEALER_TT","DLC_TT","TW003805001B",null,"台中營銷處"]
["TW003819001B","台灣樂金電器股份有限公司職工福利委員會","XXXXXXXX","XXXXXXXX","ETC","ETC","ETC","ETC","ETC_TT"]
["TW003824001B","建達國際股份有限公司","XXXXXXXX","XXXXXXXX","ID Sales","ID Sales","ID Sales"]
["TW003825001B","紅龍電器通信材料","24863233","24863223","台中營銷處","台中營銷處","台中","DEALER_TT","DLC_TT"]
["TW003826001B","姿芳企業有限公司","19681207","84085495","桃竹營銷處","桃竹營銷處","桃竹","DEALER_TT","SPD_TT"]
["TW003826002B","姿芳企業有限公司","XXXXXXXX","XXXXXXXX","ID/SAC Sales","ID/SAC Sales","ID & SAC","B2B_TT","CAC_TT"]
["TW003834001B","萊旺企業有限公司","73834893","27213625","高屏營銷處","高屏營銷處","高屏","DEALER_TT","SPD_TT","TW003834001B",720676,"高屏營銷處"]
["TW003841001B","勝奇電器","19470701","86607441","台北營銷處","台北營銷處","台北","DEALER_TT","DLC_TT","TW003841001B",42260,"台北營銷處"]
["TW003869001B","東大數位生活館","TW003869","21452063","台中營銷處","台中營銷處","台中","DEALER_TT","DLC_TT"]
["TW003873001B","日昌電器行","19590922","42101331","台北營銷處","台北營銷處","台北","DEALER_TT","DLC_TT"]
["TW003892001B","達運電器行","TW003892","06144948","台中營銷處","台中營銷處","台中","DEALER_TT","SPD_TT","TW003892001B",311201,"台中營銷處"]
["TW003898001B","科昌電器行","19761017","29458408","嘉南營銷處","嘉南營銷處","嘉南","DEALER_TT","SPD_TT","TW003898001B",2195419,"嘉南營銷處"]
["TW003899001B","王品電器有限公司","19620717","27610011","嘉南營銷處","嘉南營銷處","嘉南","DEALER_TT","DCS_TT","TW003899001B",99443,"嘉南營銷處"]
["TW003929001B","三王電業行","19710529","21497625","桃竹營銷處","桃竹營銷處","桃竹","DEALER_TT","DLC_TT","TW003929001B",27810,"桃竹營銷處"]
["TW003939001B","舊金山電料行","19680307","8027002","高屏營銷處","高屏營銷處","嘉南","DEALER_TT","DLC_TT","TW003939001B"]
["TW003954001B","順發電腦股份有限公司","89743949","70997909","HPC","IT","IT","IT_TT","IT_TT"]
["TW003954002B","順發電腦股份有限公司","20658500","20658500","HPC","百貨","百貨","DEALER_DEPT","DEALER_DEPT"]
["TW004001001B","篁翰音響工作","19740906","14486638","高屏營銷處","高屏營銷處","高屏","DEALER_TT","DLC_TT"]
["TW004046001B","益宸資訊股份有限公司","19650320","27326260","HPC","IT","IT","IT_TT","IT_TT"]
["TW004061001B","禾聲電器有限公司","TW004061","97499279","台中營銷處","台中營銷處","台中","DEALER_TT","DCS_TT","TW004061001B",208784,"台中營銷處"]
["TW004072001B","統元電器","19661203","89626772","台北營銷處","台北營銷處","台北","DEALER_TT","DLC_TT","TW004072001B",null,"台北營銷處"]
["TW004087001B","佑丞電器行","19601019","21531320","桃竹營銷處","桃竹營銷處","桃竹","DEALER_TT","DCS_TT","TW004087001B",0,"桃竹營銷處"]
["TW004122002B","進懋有限公司","XXXXXXXX","XXXXXXXX","ID Sales","ID Sales","ID Sales",null,null,"TW004122002B",526680,"ID Sales Team"]
["TW004159001B","群峰電業行","19550909","97938073","台中營銷處","台中營銷處","台中","DEALER_TT","DLC_TT"]
["TW004228001B","和新電器行","19601031","21982350","嘉南營銷處","嘉南營銷處","嘉南","DEALER_TT","DCS_TT","TW004228001B",81403,"嘉南營銷處"]
["TW004268001B","利興電器有限公司","19760526","69307407","嘉南營銷處","嘉南營銷處","嘉南","DEALER_TT","DCS_TT","TW004268001B",135543,"嘉南營銷處"]
["TW004322001B","駿輝電器行","19650314","78755947","高屏營銷處","高屏營銷處","高屏","DEALER_TT","DLC_TT","TW004322001B",71449,"高屏營銷處"]
["TW004326001B","大隆電器","19630103","36456968","桃竹營銷處","桃竹營銷處","桃竹","DEALER_TT","DLC_TT"]
["TW004340001B","呈品家電有限公司","19600312","27962373","台北營銷處","台北營銷處","台北","DEALER_TT","DLC_TT","TW004340001B",0,"台北營銷處"]
["TW004346001B","眾佳企業","TW004346","23834320","台中營銷處","台中營銷處","台中","DEALER_TT","DLC_TT"]
["TW004348001B","晉宏電器行","19651110","90964899","高屏營銷處","高屏營銷處","高屏","DEALER_TT","SPD_TT","TW004348001B",154166,"高屏營銷處"]
["TW004349001B","耀企業有限公司","19581220","12920636","高屏營銷處","高屏營銷處","高屏","DEALER_TT","SPD_TT","TW004349001B",2591550,"高屏營銷處"]
["TW004355001B","承泰電器行","19580805","49919533","台北營銷處","台北營銷處","台北","DEALER_TT","DCS_TT","TW004355001B",144608,"台北營銷處"]
["TW004361001B","振宏電器有限公司","19580401","22787756","台中營銷處","台中營銷處","台中","DEALER_TT","DLC_TT"]
["TW004363001B","柯旅天閣股份有限公司","XXXXXXXX","XXXXXXXX","台北營銷處","台北營銷處","台北","DEALER_TT","DLC_TT"]
["TW004385001B","億昌家電行","TW004385","98613067","台中營銷處","台中營銷處","台中","DEALER_TT","DCS_TT","TW004385001B",42689,"台中營銷處"]
["TW004399001B","祥建科技股份有限公司","19800610","27724730","台北營銷處","台北營銷處","台北","DEALER_TT","SPD_TT","TW004399001B",5444642,"台北營銷處"]
["TW004406001B","禾欣家電有限公司","19670712","27885171","嘉南營銷處","嘉南營銷處","嘉南","DEALER_TT","DCS_TT","TW004406001B",85666,"嘉南營銷處"]
["TW004408001B","優環冷氣空調有限公司","19750526","23096702","桃竹營銷處","桃竹營銷處","桃竹","DEALER_TT","DLC_TT"]
["TW004439001B","福城電器行","19560325","95893607","台北營銷處","台北營銷處","台北","DEALER_TT","DLC_TT","TW004439001B",null,"台北營銷處"]
["TW004443001B","大雅廚房器具有限公司","19500325","55831654","B2B2C","B2B2C","B2B2C","B2B_TT","B2B_TT",null,null,"B2B2C(B2B2C Part)"]
["TW004447001B","完全電器有限公司","19690104","16570033","嘉南營銷處","嘉南營銷處","嘉南","DEALER_TT","DLC_TT","TW004447001B",89592,"嘉南營銷處"]
["TW004450001B","鴻興電器行","19540505","73714308","嘉南營銷處","嘉南營銷處","嘉南","DEALER_TT","DLC_TT","TW004450001B",0,"嘉南營銷處"]
["TW004462001B","亙利電器行","19550909","55848326","台中營銷處","台中營銷處","台中","DEALER_TT","DLC_TT","TW004462001B",93867,"台中營銷處"]
["TW004466002B","隆豐科技有限公司","XXXXXXXX","XXXXXXXX","ID/SAC Sales","ID/SAC Sales","ID & SAC","B2B_TT","CAC_TT"]
["TW004475001B","榮茂電器有限公司","19860318","84436366","高屏營銷處","高屏營銷處","高屏","DEALER_TT","DLC_TT"]
["TW004489001B","隆輝電器行","19620902","08351788","台中營銷處","台中營銷處","台中","DEALER_TT","DCS_TT","TW004489001B",34872,"台中營銷處"]
["TW004492001B","統合電器有限公司","TW004492","28032046","台中營銷處","台中營銷處","台中","DEALER_TT","SPD_TT","TW004492001B",414102,"台中營銷處"]
["TW004507001B","全群電器","19531215","21239319","台北營銷處","台北營銷處","台北","DEALER_TT","DLC_TT"]
["TW004511001B","建昇行電器有限公司","47285890","47285891","台中營銷處","台中營銷處","台中","DEALER_TT","DLC_TT"]
["TW004547002B","年高企業有限公司","XXXXXXXX","XXXXXXXX","ID/SAC Sales","ID/SAC Sales","ID & SAC","B2B_TT","CAC_TT"]
["TW004604001B","台北市國稅局","XXXXXXXX","XXXXXXXX","ETC","ETC","ETC","ETC","ETC_TT"]
["TW004610001B","神坊資訊股份有限公司","XXXXXXXX","XXXXXXXX","HPC","ONLINE","ONLINE","INT_TT","TW004610001B","TW004610001B",null,"ONLINE"]
["TW004640001B","榮迎空調電器行","19671018","09636833","桃竹營銷處","桃竹營銷處","桃竹","DEALER_TT","DLC_TT","TW004640001B",0,"桃竹營銷處"]
["TW004654001B","廣福電器行","19560228","09649176","台北營銷處","台北營銷處","台北","DEALER_TT","DLC_TT","TW004654001B",null,"台北營銷處"]
["TW004681001B","濟洋電器股份有限公司","19690830","16331049","台北營銷處","台北營銷處","台北","DEALER_TT","DCS_TT","TW004681001B",null,"台北營銷處"]
["TW004694001B","領侁電器有限公司","19810702","28166558","台北營銷處","台北營銷處","台北","DEALER_TT","DCS_TT","TW004694001B",2779461,"台北營銷處"]
["TW004700001B","鐠羅影音空調生活館","19661129","09689654","桃竹營銷處","桃竹營銷處","桃竹","DEALER_TT","SPD_TT","TW004700001B",4620529,"桃竹營銷處"]
["TW004714001B","冠統商百貨企業有限公司","19711005","23976994","高屏營銷處","高屏營銷處","高屏","DEALER_TT","DLC_TT","TW004714001B",33834,"高屏營銷處"]
["TW004724001B","新視紀科技有限公司","19690723","28108925","桃竹營銷處","桃竹營銷處","桃竹","DEALER_TT","SPD_TT","TW004724001B",5045902,"桃竹營銷處"]
["TW004731001B","柯達大飯店股份有限公司","XXXXXXXX","XXXXXXXX","ID/SAC Sales","ID/SAC Sales","ID & SAC","B2B_TT","CAC_TT"]
["TW004735001B","柯達大飯店股份有限公司中山分公司","XXXXXXXX","XXXXXXXX","ID/SAC Sales","ID/SAC Sales","ID & SAC","B2B_TT","CAC_TT"]
["TW004741001B","錦輝電器有限公司","19600212","22906850","台北營銷處","台北營銷處","台北","DEALER_TT","DLC_TT","TW004741001B",0]
["TW004750001B","北電科技企業","19660413","80595637","台北營銷處","台北營銷處","台北","DEALER_TT","DLC_TT"]
["TW004758001B","同勝電器有限公司","19760806","22551604","高屏營銷處","高屏營銷處","高屏","DEALER_TT","SPD_TT","TW004758001B",10372739,"高屏營銷處"]
["TW004765001B","泰梭股份","19580415","16317736","台北營銷處","台北營銷處","台北","DEALER_TT","DCS_TT"]
["TW004777001B","品蓁電器行","19631230","45338936","桃竹營銷處","桃竹營銷處","桃竹","DEALER_TT","DCS_TT","TW004777001B",0,"桃竹營銷處"]
["TW004780001B","群大電子專賣店","TW004780","76656175","台中營銷處","台中營銷處","台中","DEALER_TT","DLC_TT","TW004780001B",0,"台中營銷處"]
["TW004787001B","大都會電器事業","TW004787","13025829","台中營銷處","台中營銷處","台中","DEALER_TT","DLC_TT"]
["TW004801001B","詠鴻電器行","19711007","09997596","桃竹營銷處","桃竹營銷處","桃竹","DEALER_TT","DLC_TT"]
["TW004816001B","三益電器行","TW004816","59251657","台中營銷處","台中營銷處","台中","DEALER_TT","DCS_TT","TW004816001B",160307,"台中營銷處"]
["TW004817001B","前峰家電量販店","19720114","99139385","高屏營銷處","高屏營銷處","高屏","DEALER_TT","DCS_TT","TW004817001B",457612,"高屏營銷處"]
["TW004819001B","慶聲電器行","19630105","02764278","桃竹營銷處","桃竹營銷處","桃竹","DEALER_TT","DCS_TT","TW004819001B",185555,"桃竹營銷處"]
["TW004826001B","龍輝電業社","19750804","02709521","桃竹營銷處","桃竹營銷處","桃竹","DEALER_TT","DCS_TT","TW004826001B",262051,"桃竹營銷處"]
["TW004836001B","瑞馨家電事業有限公司","24566769","23189954","台北營銷處","台北營銷處","台北","DEALER_TT","DLC_TT","TW004836001B",82263,"台北營銷處"]
["TW004840001B","仰光有限公司","TW004840","28545117","台中營銷處","台中營銷處","台中","DEALER_TT","DLC_TT","TW004840001B",665282,"台中營銷處"]
["TW004842001B","聯豐企業社","19550920","40636226","台北營銷處","台北營銷處","台北","DEALER_TT","DCS_TT","TW004842001B",46990,"台北營銷處"]
["TW004862001B","翔麒事業","19540102","28287407","高屏營銷處","高屏營銷處","高屏","DEALER_TT","DLC_TT"]
["TW004863001B","昇洋電器","19760205","09993819","台北營銷處","台北營銷處","台北","DEALER_TT","DLC_TT"]
["TW004867001B","東訊股份有限公司","19610505","47224065","行動電話","行動電話","行動電話","GSM_TT","GSM_TT"]
["TW004881001B","台灣大哥大股份有限公司","XXXXXXXX","XXXXXXXX","行動電話","行動電話","行動電話","GSM_TT","GSM_TT","TW004881001B",null,"行動電話 "]
["TW004888001B","順鴻電器行","TW004888","21861877","台中營銷處","台中營銷處","台中","DEALER_TT","DLC_TT","TW004888001B",0,"台中營銷處"]
["TW004896001B","上鑫電器行","TW004896","45359538","台中營銷處","台中營銷處","台中","DEALER_TT","DLC_TT","TW004896001B",11225,"台中營銷處"]
["TW004903001B","概念電器有限公司","19620810","13084050","台北營銷處","台北營銷處","台北","DEALER_TT","DLC_TT","TW004903001B",null,"台北營銷處"]
["TW004913001B","星裕國際股份有限公司","XXXXXXXX","XXXXXXXX","ID/SAC Sales","ID/SAC Sales","ID & SAC","B2B_TT","CAC_TT"]
["TW004919001B","元盟電器行","TW004919","45401212","台中營銷處","台中營銷處","台中","DEALER_TT","DLC_TT","TW004919001B",49241,"台中營銷處"]
["TW004927001B","大橋電器行","19710228","36686883","嘉南營銷處","嘉南營銷處","嘉南","DEALER_TT","DCS_TT","TW004927001B",0,"嘉南營銷處"]
["TW004929001B","聯錩順電器有限公司","19690811","28335549","台北營銷處","台北營銷處","台北","DEALER_TT","DCS_TT","TW004929001B",1485282,"台北營銷處"]
["TW004934001B","承暉電器行","47241709","37794309","台中營銷處","台中營銷處","台中","DEALER_TT","DLC_TT"]
["TW004942002B","明達電器行","15764237","15764237","台北營銷處","台北營銷處","台北","DEALER_TT","DCS_TT","TW004942002B",0,"台北營銷處"]
["TW004948001B","正旺電器行","19580802","92097950","台北營銷處","台北營銷處","台北","DEALER_TT","DCS_TT","TW004948001B",null,"台北營銷處"]
["TW004949001B","正伸電器行","TW004949","06015607","台中營銷處","台中營銷處","台中","DEALER_TT","DLC_TT"]
["TW004963001B","柯達大飯店(股)公司永和分公司","XXXXXXXX","XXXXXXXX","ID/SAC Sales","ID/SAC Sales","ID & SAC","B2B_TT","CAC_TT"]
["TW004969001B","春帆電氣行","19630626","05987717","台中營銷處","台中營銷處","台中","DEALER_TT","DLC_TT"]
["TW004987001B","開勝電器專賣店","19690824","80941898","高屏營銷處","高屏營銷處","高屏","DEALER_TT","DLC_TT","TW004987001B",0,"高屏營銷處"]
["TW004993001B","宗明電業行","TW004993","05387278","台中營銷處","台中營銷處","台中","DEALER_TT","DLC_TT","TW004993001B",19525,"台中營銷處"]
["TW005002001B","感動國際股份有限公司","XXXXXXXX","XXXXXXXX","行動電話","行動電話","行動電話","GSM_TT","GSM_TT"]
["TW005006001B","佳信電器行","TW005006","61787699","台中營銷處","台中營銷處","台中","DEALER_TT","DLC_TT","TW005006001B",0,"台中營銷處"]
["TW005008001B","華渝企業有限公司","19670826","16815353","高屏營銷處","高屏營銷處","高屏","DEALER_TT","DCS_TT","TW005008001B",181536,"高屏營銷處"]
["TW005009001B","三豊電器行","TW005009","45443402","台中營銷處","台中營銷處","台中","DEALER_TT","DLC_TT"]
["TW005010001B","華亞數位家電行","19550909","45510083","台中營銷處","台中營銷處","台中","DEALER_TT","DLC_TT","TW005010001B",79119,"台中營銷處"]
["TW005021001B","大東電器有限公司","19770127","80634435","桃竹營銷處","桃竹營銷處","桃竹","DEALER_TT","DCS_TT","TW005021001B",42306,"桃竹營銷處"]
["TW005027002B","華資電有限公司","19680602","28811971","桃竹營銷處","桃竹營銷處","桃竹","DEALER_TT","SPD_TT","TW005027002B",810659,"桃竹營銷處"]
["TW005039002B","台灣樂金化學股份有限公司台中分公司","XXXXXXXX","XXXXXXXX","ETC","ETC","ETC","ETC","ETC_TT"]
["TW005047002B","巨勝電器","19700731","86998524","台北營銷處","台北營銷處","台北","DEALER_TT","DLC_TT"]
["TW005052002B","順益電器行","19680115","78621048","台中營銷處","台中營銷處","台中","DEALER_TT","DLC_TT"]
["TW005053002B","冠元電器行","19741116","13736270","台中營銷處","台中營銷處","台中","DEALER_TT","DLC_TT","TW005053002B",0,"台中營銷處"]
["TW005057001B","凱全電器行","TW005057","06127650","台中營銷處","台中營銷處","台中","DEALER_TT","DLC_TT","TW005057001B",0,"台中營銷處"]
["TW005059001B","立欣電器有限公司","19540718","80130510","桃竹營銷處","桃竹營銷處","桃竹","DEALER_TT","DCS_TT","TW005059001B",120450,"桃竹營銷處"]
["TW005064001B","竹一鑫電器有限公司","19630903","27380361","桃竹營銷處","桃竹營銷處","桃竹","DEALER_TT","DCS_TT","TW005064001B",1028114,"桃竹營銷處"]
["TW005064002B","竹一鑫電器有限公司","XXXXXXXX","XXXXXXXX","ID/SAC Sales","ID/SAC Sales","ID & SAC","B2B_TT","CAC_TT"]
["TW005067001B","欣音電器行","TW005067","80840553","台中營銷處","台中營銷處","台中","DEALER_TT","DLC_TT"]
["TW005084001B","東隆電器有限公司","69397245","22095261","嘉南營銷處","嘉南營銷處","嘉南","DEALER_TT","DCS_TT","TW005084001B",5226634,"嘉南營銷處"]
["TW005090001B","森永電器行","24825312","24853207","台中營銷處","台中營銷處","台中","DEALER_TT","DCS_TT","TW005090001B",190499,"台中營銷處"]
["TW005091001B","祥安電器行","TW005091","45468753","台中營銷處","台中營銷處","台中","DEALER_TT","DCS_TT","TW005091001B",26346,"台中營銷處"]
["TW005099001B","誠翔音響電器","19700206","28838373","台北營銷處","台北營銷處","台北","DEALER_TT","SPD_TT"]
["TW005105001B","松禾電器行","TW005105","14969894","台中營銷處","台中營銷處","台中","DEALER_TT","DLC_TT","TW005105001B"]
["TW005108001B","祥盛電器有限公司","19651104","28952325","嘉南營銷處","嘉南營銷處","嘉南","DEALER_TT","DCS_TT","TW005108001B",129652,"嘉南營銷處"]
["TW005110001B","宏達電器行","TW005110","77784917","台中營銷處","台中營銷處","台中","DEALER_TT","DLC_TT","TW005110001B",0,"台中營銷處"]
["TW005115001B","明震實業有限公司","19690607","28608040","高屏營銷處","高屏營銷處","高屏","DEALER_TT","DLC_TT","TW005115001B",null,"高屏營銷處"]
["TW005117001B","正昌電器有限公司","TW005117","97549530","台中營銷處","台中營銷處","台中","DEALER_TT","DLC_TT","TW005117001B"]
["TW005121001B","各一有限公司","TW005121","28962750","台中營銷處","台中營銷處","台中","DEALER_TT","DLC_TT","TW005121001B",0,"台中營銷處"]
["TW005122001B","皇吉科技電器行","TW005122","45638265","台中營銷處","台中營銷處","台中","DEALER_TT","DLC_TT","TW005122001B",0,"台中營銷處"]
["TW005141001B","富基電通股份有限公司","AFASTOR1","27525541","HPC","IT","IT","IT_TT","IT_TT","TW005141001B",12012560,"IT"]
["TW005157002B","金正興國際有限公司","XXXXXXXX","XXXXXXXX","ID/SAC Sales","ID/SAC Sales","ID & SAC","B2B_TT","CAC_TT"]
["TW005160001B","弘展電器行","19780718","17498019","高屏營銷處","高屏營銷處","高屏","DEALER_TT","DCS_TT","TW005160001B",192894,"高屏營銷處"]
["TW005164001B","廣隆電器行","TW005164","05585609","台中營銷處","台中營銷處","台中","DEALER_TT","DLC_TT",null,0,"台中營銷處"]
["TW005169001B","慶明電器行","19720319","91954618","高屏營銷處","高屏營銷處","高屏","DEALER_TT","DLC_TT","TW005169001B",33834,"高屏營銷處"]
["TW005174001B","三泰電器行","TW005174","05822032","台中營銷處","台中營銷處","台中","DEALER_TT","DLC_TT","TW005174001B",null,"台中營銷處"]
["TW005180001B","大山電器行","TW005180","45690515","台中營銷處","台中營銷處","台中","DEALER_TT","DLC_TT"]
["TW005181001B","皇儒貴有限公司","AAG25988","S2508000","ID/SAC Sales","ID/SAC Sales","ID & SAC","B2B_TT","CAC_TT"]
["TW005193001B","上品電器行","19650610","92841888","桃竹營銷處","桃竹營銷處","桃竹","DEALER_TT","DCS_TT","TW005193001B",138146,"桃竹營銷處"]
["TW005197001B","金城電器行","19611020","95993900","高屏營銷處","高屏營銷處","高屏","DEALER_TT","DCS_TT","TW005197001B",150834,"高屏營銷處"]
["TW005202001B","通豪電器股份有限公司","19660519","16956304","嘉南營銷處","嘉南營銷處","嘉南","DEALER_TT","DCS_TT","TW005202001B",965151,"嘉南營銷處"]
["TW005206001B","大潤發流通事業股份有限公司嘉義分公司","97165560","97165560","MMCS-大潤發","大潤發","MMCS","MMCS_RT","MMC_TT","TW005206001B",0,"大潤發"]
["TW005215001B","盛雄電器行","19621111","02925154","桃竹營銷處","桃竹營銷處","桃竹","DEALER_TT","DCS_TT","TW005215001B",437237,"桃竹營銷處"]
["TW005218001B","峰瑞電器行","19830808","43918277","桃竹營銷處","桃竹營銷處","桃竹","DEALER_TT","DCS_TT","TW005218001B",61218,"桃竹營銷處"]
["TW005240001B","永順錩電器有限公司","19570430","27417698","桃竹營銷處","桃竹營銷處","桃竹","DEALER_TT","DCS_TT","TW005240001B",767380,"桃竹營銷處"]
["TW005253001B","視紀音響","19630525","30154699","桃竹營銷處","桃竹營銷處","桃竹","DEALER_TT","DLC_TT"]
["TW005255001B","向達企業股份有限公司","XXXXXXXX","XXXXXXXX","ID/SAC Sales","ID/SAC Sales","ID & SAC","B2B_TT","CAC_TT"]
["TW005258001B","禾佳電器行","TW005258","14157158","台中營銷處","台中營銷處","台中","DEALER_TT","SPD_TT","TW005258001B",960081,"台中營銷處"]
["TW005259001B","富禾電器有限公司","19621105","84158686","台北營銷處","台北營銷處","台北","DEALER_TT","DCS_TT","TW005259001B",277417,"台北營銷處"]
["TW005259002B","富禾電器有限公司","XXXXXXXX","XXXXXXXX","ID/SAC Sales","ID/SAC Sales","ID & SAC","B2B_TT","CAC_TT"]
["TW005264001B","禾昌電器行","19641202","10805940","嘉南營銷處","嘉南營銷處","嘉南","DEALER_TT","SPD_TT","TW005264001B",913880,"嘉南營銷處"]
["TW005266001B","承鑫電器行","TW005266","55726153","台中營銷處","台中營銷處","台中","DEALER_TT","DCS_TT","TW005266001B",618479,"台中營銷處"]
["TW005267001B","佳園生活精品室","19680724","02482989","桃竹營銷處","桃竹營銷處","桃竹","DEALER_TT","DCS_TT","TW005267001B",48463,"桃竹營銷處"]
["TW005268001B","鋒益家電有限公司","19690102","28842989","台北營銷處","台北營銷處","台北","DEALER_TT","DCS_TT","TW005268001B",84649,"台北營銷處"]
["TW005270001B","金大電器行","19460315","05798574","台中營銷處","台中營銷處","台中","DEALER_TT","DLC_TT","TW005270001B",18619,"台中營銷處"]
["TW005274001B","郁誠電器有限公司","19630811","24317387","台北營銷處","台北營銷處","台北","DEALER_TT","DLC_TT","TW005274001B",173812,"台北營銷處"]
["TW005279001B","鼎鋒國際有限公司","TW005279","16256105","台中營銷處","台中營銷處","台中","DEALER_TT","DLC_TT",null,19525]
["TW005281001B","映象國際企業有限公司","24323162","24323162","HPC","百貨","百貨","DEALER_DEPT","DEALER_DEPT","TW005281001B",6005444,"百貨"]
["TW005288001B","五順電器有限公司","19551211","24356677","台北營銷處","台北營銷處","台北","DEALER_TT","SPD_TT","TW005288001B",623516,"台北營銷處"]
["TW005301001B","南霸天電器有限公司","19670508","24353242","高屏營銷處","高屏營銷處","高屏","DEALER_TT","SPD_TT","TW005301001B",2689060,"高屏營銷處"]
["TW005311001B","三越電子科技有限公司","XXXXXXXX","XXXXXXXX","ID/SAC Sales","ID/SAC Sales","ID & SAC","B2B_TT","CAC_TT"]
["TW005317001B","三菱視訊股份有限公司","19510826","24352335","嘉南營銷處","嘉南營銷處","嘉南","DEALER_TT","SPD_TT","TW005317001B",null,"嘉南營銷處"]
["TW005317002B","三菱視訊股份有限公司","XXXXXXXX","XXXXXXXX","ID/SAC Sales","ID/SAC Sales","ID & SAC","B2B_TT","CAC_TT"]
["TW005336001B","兆洋音響企業社","XXXXXXXX","XXXXXXXX","高屏營銷處","高屏營銷處","高屏","DEALER_TT","DLC_TT"]
["TW005347001B","佳能昕普股份有限公司","XXXXXXXX","XXXXXXXX","ID Sales","ID Sales","ID Sales",null,null,"TW005347001B",2100,"ID Sales Team"]
["TW005347002B","佳能昕普股份有限公司","XXXXXXXX","XXXXXXXX","B2B2C","B2B2C","B2B2C","B2B_TT","B2B_TT","TW005347002B",3707101,"B2B2C(B2B2C Part)"]
["TW005353001B","永昌電器有限公司","TW005353","22983429","台中營銷處","台中營銷處","台中","DEALER_TT","DCS_TT","TW005353001B",756766,"台中營銷處"]
["TW005358001B","力碩企業股份有限公司","19630713","12909061","桃竹營銷處","桃竹營銷處","桃竹","DEALER_TT","DCS_TT","TW005358001B",693577,"桃竹營銷處"]
["TW005360001B","冠成家電有限公司","XXXXXXXX","XXXXXXXX","ID/SAC Sales","ID/SAC Sales","ID & SAC","B2B_TT","CAC_TT"]
["TW005360002B","冠成家電有限公司","XXXXXXXX","XXXXXXXX","台北營銷處","台北營銷處","台北","DEALER_TT","DCS_TT"]
["TW005386001B","台灣威創有限公司","XXXXXXXX","XXXXXXXX","ID Sales","ID Sales","ID Sales"]
["TW005403001B","南商企業有限公司","XXXXXXXX","XXXXXXXX","ID/SAC Sales","ID/SAC Sales","ID & SAC","B2B_TT","CAC_TT"]
["TW005406001B","百裕電業有限公司","26521066","16290482","台北營銷處","台北營銷處","台北","DEALER_TT","DCS_TT","TW005406001B",1496928,"台北營銷處"]
["TW005406002B","百裕電業有限公司","XXXXXXXX","XXXXXXXX","ID/SAC Sales","ID/SAC Sales","ID & SAC","B2B_TT","CAC_TT"]
["TW005413001B","泰銓電器行","19681220","10840334","嘉南營銷處","嘉南營銷處","嘉南","DEALER_TT","DCS_TT","TW005413001B",439866,"嘉南營銷處"]
["TW005416001B","極品家電","47258638","15635579","台中營銷處","台中營銷處","台中","DEALER_TT","DCS_TT"]
["TW005438001B","仕華國際","13127396","13127396","HPC","百貨","百貨","DEALER_DEPT","DEALER_DEPT"]
["TW005440001B","玉明電器有限公司","19670918","29134078","台北營銷處","台北營銷處","台北","DEALER_TT","SPD_TT","TW005440001B",687147,"台北營銷處"]
["TW005448001B","大潤發流通事業股份有限公司鳳山分公司","97165560","97165560","MMCS-大潤發","大潤發","MMCS","MMCS_RT","MMC_TT","TW005448001B",null,"大潤發"]
["TW005450001B","富麗電器行","XXXXXXXX","XXXXXXXX","ID/SAC Sales","ID/SAC Sales","ID & SAC","B2B_TT","CAC_TT"]
["TW005451001B","富新電器有限公司","XXXXXXXX","XXXXXXXX","ID/SAC Sales","ID/SAC Sales","ID & SAC","B2B_TT","CAC_TT"]
["TW005455001B","富耀電器行","19491019","08289125","台中營銷處","台中營銷處","台中","DEALER_TT","DLC_TT"]
["TW005471001B","拍譜音響工程有限公司","19670902","25133415","台北營銷處","台北營銷處","台北","DEALER_TT","DLC_TT"]
["TW005475001B","太夆音響電業行","19590717","30209478","台北營銷處","台北營銷處","台北","DEALER_TT","DLC_TT","TW005475001B",0,"台北營銷處"]
["TW005487001B","大潤發流通事業股份有限公司中和分公司","97165560","97165560","MMCS-大潤發","大潤發","MMCS","MMCS_RT","MMC_TT","TW005487001B",null,"大潤發"]
["TW005488001B","大潤發流通事業股份有限公司中壢分公司","97165560","97165560","MMCS-大潤發","大潤發","MMCS","MMCS_RT","MMC_TT","TW005488001B",null,"大潤發"]
["TW005489001B","大潤發流通事業股份有限公司斗南分公司","97165560","97165560","MMCS-大潤發","大潤發","MMCS","MMCS_RT","MMC_TT","TW005489001B",45631,"大潤發"]
["TW005490001B","大潤發流通事業股份有限公司內湖分公司","97165560","97165560","MMCS-大潤發","大潤發","MMCS","MMCS_RT","MMC_TT",null,null,"大潤發"]
["TW005491001B","大潤發流通事業股份有限公司台中分公司","97165560","97165560","MMCS-大潤發","大潤發","MMCS","MMCS_RT","MMC_TT","TW005491001B",30421,"大潤發"]
["TW005492001B","大潤發流通事業股份有限公司南湖分公司","97165560","97165560","MMCS-大潤發","大潤發","MMCS","MMCS_RT","MMC_TT","TW005492001B",100262,"大潤發"]
["TW005493001B","大潤發流通事業股份有限公司平鎮分公司","97165560","97165560","MMCS-大潤發","大潤發","MMCS","MMCS_RT","MMC_TT","TW005493001B",17910,"大潤發"]
["TW005495001B","大潤發流通事業股份有限公司新店分公司","97165560","97165560","MMCS-大潤發","大潤發","MMCS","MMCS_RT","MMC_TT","TW005495001B",null,"大潤發"]
["TW005496001B","潤泰全球股份有限公司中和分公司","97165560","97165560","MMCS-大潤發","大潤發","MMCS","MMCS_RT","MMC_TT","TW005496001B",63541,"大潤發"]
["TW005497001B","興業建設股份有限公司員林分公司","97165560","97165560","MMCS-大潤發","大潤發","MMCS","MMCS_RT","MMC_TT"]
["TW005499001B","大潤發流通事業股份有限公司土城分公司","97165560","97165560","MMCS-大潤發","大潤發","MMCS","MMCS_RT","MMC_TT","TW005499001B",127082,"大潤發"]
["TW005501001B","大買家股份有限公司大里國光分公司","97165560","97165560","MMCS-大潤發","大潤發","MMCS","MMCS_RT","MMC_TT","TW005501001B",null,"大潤發"]
["TW005502001B","大買家股份有限公司","97165560","97165560","MMCS-大潤發","大潤發","MMCS","MMCS_RT","MMC_TT"]
["TW005503001B","東逸企業股份有限公司八堵物流中心","97165560","97165560","MMCS-大潤發","大潤發","MMCS","MMCS_RT","MMC_TT"]
["TW005504001B","大買家股份有限公司台中北屯分公司","97165560","97165560","MMCS-大潤發","大潤發","MMCS","MMCS_RT","MMC_TT","TW005504001B",17910,"大潤發"]
["TW005511001B","柯達大飯店股份有限公司台北分公司","XXXXXXXX","XXXXXXXX","ID/SAC Sales","ID/SAC Sales","ID & SAC","B2B_TT","CAC_TT"]
["TW005521001B","上十慶電器有限公司","XXXXXXXX","XXXXXXXX","ID/SAC Sales","ID/SAC Sales","ID & SAC","B2B_TT","CAC_TT"]
["TW005525001B","雷光聲電器有限公司","19610526","53053390","桃竹營銷處","桃竹營銷處","桃竹","DEALER_TT","DCS_TT","TW005525001B",315043,"桃竹營銷處"]
["TW005532001B","財源電器行","19800906","10884162","高屏營銷處","高屏營銷處","高屏","DEALER_TT","DCS_TT",null,26346,"高屏營銷處"]
["TW005539001B","金隆系統科技有限公司","XXXXXXXX","XXXXXXXX","ID/SAC Sales","ID/SAC Sales","ID & SAC","B2B_TT","CAC_TT"]
["TW005541001B","大潤發流通事業股份有限公司頭份分公司","97165560","97165560","MMCS-大潤發","大潤發","MMCS","MMCS_RT","MMC_TT","TW005541001B",136893,"大潤發"]
["TW005542001B","萬家吉商行","19690817","25934014","高屏營銷處","高屏營銷處","高屏","DEALER_TT","SPD_TT","TW005542001B",3001469,"高屏營銷處"]
["TW005543001B","享亮電器行","19750107","45705778","台中營銷處","台中營銷處","台中","DEALER_TT","DCS_TT","TW005543001B",41940,"台中營銷處"]
["TW005550001B","麥得森企業有限公司","XXXXXXXX","XXXXXXXX","ID/SAC Sales","ID/SAC Sales","ID & SAC","B2B_TT","CAC_TT"]
["TW005578001B","大同綜合訊電股份有限公司","70788522","70788522","MMCS-大同","大同","MMCS","MMCS_OTHERS","CSC_TT","TW005578001B",4498020,"大同"]
["TW005582001B","東富電業行","TW005582","10920012","台中營銷處","台中營銷處","台中","DEALER_TT","DCS_TT"]
["TW005585001B","金帝國音響企業社","19700629","30202524","台北營銷處","台北營銷處","台北","DEALER_TT","DLC_TT"]
["TW005590001B","新遠東有限公司","19611016","80654327","台北營銷處","台北營銷處","台北","DEALER_TT","DLC_TT","TW005590001B",60245,"台北營銷處"]
["TW005593001B","美光節能科技有限公司","19630701","25062853","桃竹營銷處","桃竹營銷處","桃竹","DEALER_TT","DCS_TT","TW005593001B",2843101,"桃竹營銷處"]
["TW005594001B","大潤發流通事業股份有限公司八德分公司","97165560","97165560","MMCS-大潤發","大潤發","MMCS","MMCS_RT","MMC_TT","TW005594001B",153903,"大潤發"]
["TW005598001B","百事得專業音響","19791015","14227197","台中營銷處","台中營銷處","台中","DEALER_TT","SPD_TT","TW005598001B",18376,"台中營銷處"]
["TW005601001B","瑞風電器行","19581227","21348822","高屏營銷處","高屏營銷處","高屏","DEALER_TT","DLC_TT","TW005601001B",null,"高屏營銷處"]
["TW005602001B","好佳貨家電影音生活館","19740908","25705440","高屏營銷處","高屏營銷處","高屏","DEALER_TT","SPD_TT","TW005602001B",890769,"高屏營銷處"]
["TW005605001B","首昌電器有限公司","19791030","29160244","桃竹營銷處","桃竹營銷處","桃竹","DEALER_TT","DLC_TT"]
["TW005607001B","創新行銷有限公司","19670911","25150547","台中營銷處","台中營銷處","台中","DEALER_TT","DLC_TT","TW005607001B",9610,"台中營銷處"]
["TW005608001B","盈成興業有限公司","19840923","53114501","台北營銷處","台北營銷處","台北","DEALER_TT","DLC_TT","TW005608001B",30565,"台北營銷處"]
["TW005616001B","金力盛有限公司","19580918","97040491","桃竹營銷處","桃竹營銷處","桃竹","DEALER_TT","DLC_TT"]
["TW005617001B","麥仕視聽音響有限公司","19780705","53168294","桃竹營銷處","桃竹營銷處","桃竹","DEALER_TT","DLC_TT","TW005617001B",1322873,"桃竹營銷處"]
["TW005621001B","益昇商行","TW005621","90952027","台中營銷處","台中營銷處","台中","DEALER_TT","DLC_TT"]
["TW005622001B","原駿家電音響有限公司","19820328","53213489","台北營銷處","台北營銷處","台北","DEALER_TT","DCS_TT"]
["TW005641001B","德豐國際資訊有限公司","19740128","80630846","桃竹營銷處","桃竹營銷處","桃竹","DEALER_TT","DLC_TT","TW005641001B",70189,"桃竹營銷處"]
["TW005648001B","金上順電器有限公司","19590119","86959830","桃竹營銷處","桃竹營銷處","桃竹","DEALER_TT","DCS_TT","TW005648001B",306856,"桃竹營銷處"]
["TW005661001B","中彰電器行","47284363","23871888","台中營銷處","台中營銷處","台中","DEALER_TT","DLC_TT"]
["TW005662001B","統勝電器有限公司","19760806","53243619","高屏營銷處","高屏營銷處","高屏","DEALER_TT","SPD_TT","TW005662001B",1111954,"高屏營銷處"]
["TW005672001B","新揚電業行","19621219","08075123","高屏營銷處","高屏營銷處","高屏","DEALER_TT","DLC_TT"]
["TW005675001B","聯毅家電生活館","24725315","24751732","台中營銷處","台中營銷處","台中","DEALER_TT","DCS_TT","TW005675001B",108865,"台中營銷處"]
["TW005677001B","好市多股份有限公司","96972798","96972798","MMCS-好市多","好市多","MMCS","MMCS_COSTCO","MMC_TT","TW005677001B",1889617,"連鎖量販-OTHERS"]
["TW005680001B","柯達大飯店股份有限公司敦南分公司","XXXXXXXX","XXXXXXXX","ID/SAC Sales","ID/SAC Sales","ID & SAC","B2B_TT","CAC_TT"]
["TW005681001B","好市多股份有限公司汐止分公司","96972798","96972798","MMCS-好市多","好市多","MMCS","MMCS_COSTCO","MMC_TT",null,null,"連鎖量販-OTHERS"]
["TW005682001B","好市多股份有限公司內湖分公司","96972798","96972798","MMCS-好市多","好市多","MMCS","MMCS_COSTCO","MMC_TT",null,null,"連鎖量販-OTHERS"]
["TW005683001B","好市多股份有限公司中和分公司","96972798","96972798","MMCS-好市多","好市多","MMCS","MMCS_COSTCO","MMC_TT",null,null,"連鎖量販-OTHERS"]
["TW005684001B","好市多股份有限公司台中分公司","96972798","96972798","MMCS-好市多","好市多","MMCS","MMCS_COSTCO","MMC_TT",null,null,"連鎖量販-OTHERS"]
["TW005686001B","好市多股份有限公司新竹分公司","96972798","96972798","MMCS-好市多","好市多","MMCS","MMCS_COSTCO","MMC_TT",null,null,"連鎖量販-OTHERS"]
["TW007200001B","好市多股份有限公司北台中分公司","96972798","96972798","MMCS-好市多","好市多","MMCS","MMCS_COSTCO","MMC_TT",null,null,"連鎖量販-OTHERS"]
["TW005687001B","豐億電器有限公司","19590519","05256661","台北營銷處","台北營銷處","台北","DEALER_TT","DLC_TT","TW005687001B",null,"台北營銷處"]
["TW005689001B","洸毅企業社","TW005689","26800273","台中營銷處","台中營銷處","台中","DEALER_TT","DLC_TT","TW005689001B",0,"台中營銷處"]
["TW005692001B","*","XXXXXXXX","XXXXXXXX","ID/SAC Sales","ID/SAC Sales","ID & SAC","B2B_TT","CAC_TT"]
["TW005696001B","皇冠電氣行","19620404","08079367","高屏營銷處","高屏營銷處","高屏","DEALER_TT","DLC_TT","TW005696001B",null,"高屏營銷處"]
["TW005701001B","台灣歐？空調股份有限公司","XXXXXXXX","XXXXXXXX","ID/SAC Sales","ID/SAC Sales","ID & SAC","B2B_TT","CAC_TT"]
["TW005702001B","京東科技有限公司","19810404","28221588","台北營銷處","台北營銷處","台北","DEALER_TT","DCS_TT","TW005702001B",2042764,"台北營銷處"]
["TW005702002B","京東科技有限公司","XXXXXXXX","XXXXXXXX","ETC","ETC","ETC","ETC","ETC_TT"]
["TW005705001B","碩展電器行","19660503","09699132","桃竹營銷處","桃竹營銷處","桃竹","DEALER_TT","DLC_TT","TW005705001B",null,"桃竹營銷處"]
["TW005718001B","好市多股份有限公司大順分公司","96972798","96972798","MMCS-好市多","好市多","MMCS","MMCS_COSTCO","MMC_TT",null,null,"連鎖量販-OTHERS"]
["TW005719001B","好市多股份有限公司台南分公司","96972798","96972798","MMCS-好市多","好市多","MMCS","MMCS_COSTCO","MMC_TT",null,null,"連鎖量販-OTHERS"]
["TW005720001B","大頂金電器有限公司","19580323","53249780","高屏營銷處","高屏營銷處","高屏","DEALER_TT","DLC_TT","TW005720001B",0,"高屏營銷處"]
["TW006068001B","銓薪電器行","19640626","25214676","台中營銷處","台中營銷處","台中","DEALER_TT","DLC_TT","TW006068001B",29797,"台中營銷處"]
["TW006074001B","大隆電器行","19660303","45217671","桃竹營銷處","桃竹營銷處","桃竹","DEALER_TT","DLC_TT"]
["TW006081001B","凱創國際股份有限公司","XXXXXXXX","XXXXXXXX","ID/SAC Sales","ID/SAC Sales","ID & SAC","B2B_TT","CAC_TT"]
["TW006083001B","金昌通信器材有限公司","XXXXXXXX","XXXXXXXX","ID/SAC Sales","ID/SAC Sales","ID & SAC","B2B_TT","CAC_TT"]
["TW006084001B","上晟國際有限公司","19770112","53335223","台北營銷處","台北營銷處","台北","DEALER_TT","SPD_TT","TW006084001B",2018219,"台北營銷處"]
["TW006090001B","富士多媒體有限公司","19800806","29073348","台北營銷處","台北營銷處","台北","DEALER_TT","DLC_TT","TW006090001B",null,"台北營銷處"]
["TW006098002B","臺灣銀行股份有限公司","XXXXXXXX","XXXXXXXX","ID Sales","ID Sales","ID Sales"]
["TW006101001B","匠誠","19780222","10630484","台北營銷處","台北營銷處","台北","DEALER_TT","DLC_TT"]
["TW006102001B","慧榮電器有限公司","19870724","53439542","台北營銷處","台北營銷處","台北","DEALER_TT","SPD_TT","TW006102001B",123673,"台北營銷處"]
["TW006105001B","緯泰電器有限公司","XXXXXXXX","XXXXXXXX","台北營銷處","台北營銷處","台北","DEALER_TT","DLC_TT"]
["TW006105002B","緯泰電器有限公司","XXXXXXXX","XXXXXXXX","ID/SAC Sales","ID/SAC Sales","ID & SAC","B2B_TT","CAC_TT"]
["TW006113001B","西北電器社","24834343","24831986","台中營銷處","台中營銷處","台中","DEALER_TT","DLC_TT"]
["TW006118001B","新邵有限公司","19651210","97249098","台北營銷處","台北營銷處","台北","DEALER_TT","DCS_TT","TW006118001B",1403608,"台北營銷處"]
["TW006122001B","元莊數位家電有限公司","19651110","28625548","台北營銷處","台北營銷處","台北","DEALER_TT","DLC_TT","TW006122001B",211223,"台北營銷處"]
["TW006123001B","明音電器行","XXXXXXXX","XXXXXXXX","ID/SAC Sales","ID/SAC Sales","ID & SAC","B2B_TT","CAC_TT"]
["TW006126001B","晨星半導體股份有限公司","XXXXXXXX","XXXXXXXX","台北營銷處","台北營銷處","台北","DEALER_TT","DLC_TT"]
["TW006131001B","新向系統科技股份有限公司","XXXXXXXX","XXXXXXXX","ID/SAC Sales","ID/SAC Sales","ID & SAC","B2B_TT","CAC_TT"]
["TW006137001B","上億立有限公司","19561028","96930361","台北營銷處","台北營銷處","台北","DEALER_TT","DCS_TT","TW006137001B",null,"台北營銷處"]
["TW006142001B","天韻視聽工程有限公司","TW006142","53789863","台中營銷處","台中營銷處","台中","DEALER_TT","DLC_TT","TW006142001B",0,"台中營銷處"]
["TW006143001B","立誠電器有限公司","19670302","53681960","台北營銷處","台北營銷處","台北","DEALER_TT","DCS_TT","TW006143001B",743291,"台北營銷處"]
["TW006146001B","迎冠電器實業社","19700131","26785625","台北營銷處","台北營銷處","台北","DEALER_TT","DCS_TT","TW006146001B",null,"台北營銷處"]
["TW006153001B","康銀流通股份有限公司","XXXXXXXX","XXXXXXXX","台北營銷處","台北營銷處","台北","DEALER_TT","DLC_TT"]
["TW006155001B","東紳科技有限公司","19610115","28924877","嘉南營銷處","嘉南營銷處","嘉南","DEALER_TT","DLC_TT","TW006155001B",930130,"嘉南營銷處"]
["TW006162001B","永漢允有限公司","73923339","53578728","高屏營銷處","高屏營銷處","高屏","DEALER_TT","DCS_TT","TW006162001B",394800,"高屏營銷處"]
["TW006168001B","泰川電器行","19550212","31594576","桃竹營銷處","桃竹營銷處","桃竹","DEALER_TT","DLC_TT","TW006168001B",191117,"桃竹營銷處"]
["TW006171001B","葳訊企業股份有限公司","19601024","84747988","行動電話","行動電話","行動電話","GSM_TT","GSM_TT","TW006171001B",null,"行動電話 "]
["TW006178001B","一弘電器行","19851017","02858985","桃竹營銷處","桃竹營銷處","桃竹","DEALER_TT","DLC_TT","TW006178001B",0,"桃竹營銷處"]
["TW006180001B","東翰企業社","19750510","25853814","高屏營銷處","高屏營銷處","高屏","DEALER_TT","DCS_TT","TW006180001B",109214,"高屏營銷處"]
["TW006186001B","光波電器行","19700815","39703372","嘉南營銷處","嘉南營銷處","嘉南","DEALER_TT","DCS_TT","TW006186001B",201802,"嘉南營銷處"]
["TW006187001B","好市多股份有限公司桃園分公司","96972798","96972798","MMCS-好市多","好市多","MMCS","MMCS_COSTCO","MMC_TT",null,null,"連鎖量販-OTHERS"]
["TW006205001B","利得電子音響材料行","A5259366","47285169","桃竹營銷處","桃竹營銷處","桃竹","DEALER_TT","DLC_TT"]
["TW006207001B","包昇數位文化有限公司","27192010","27197377","HPC","ONLINE","ONLINE","INT_TT","TW006207001B","TW006207001B",0,"ONLINE"]
["TW006211001B","仁澤電業行","19550619","02708500","桃竹營銷處","桃竹營銷處","桃竹","DEALER_TT","DLC_TT"]
["TW006214001B","弘立電器有限公司","19640321","70742770","台北營銷處","台北營銷處","台北","DEALER_TT","DCS_TT","TW006214001B",null,"台北營銷處"]
["TW006217001B","昌霖電器企業有限公司","TW006217","53981925","台中營銷處","台中營銷處","台中","DEALER_TT","DLC_TT","TW006217001B",0,"台中營銷處"]
["TW006235001B","傑克音響科技有限公司","TW006235","53991326","台中營銷處","台中營銷處","台中","DEALER_TT","DLC_TT"]
["TW006240001B","大聖電器有限公司","24261262","55991424","台北營銷處","台北營銷處","台北","DEALER_TT","DLC_TT","TW006240001B",null,"台北營銷處"]
["TW006243001B","宏宜企業社","XXXXXXXX","XXXXXXXX","ID/SAC Sales","ID/SAC Sales","ID & SAC","B2B_TT","CAC_TT"]
["TW006256001B","旺品電器有限公司","19680720","54096565","嘉南營銷處","嘉南營銷處","嘉南","DEALER_TT","DCS_TT","TW006256001B",59492,"嘉南營銷處"]
["TW006257001B","駿興電器","19650926","54106368","台北營銷處","台北營銷處","台北","DEALER_TT","DLC_TT"]
["TW006258001B","毅鴻電器行","TW006258","25365667","台中營銷處","台中營銷處","台中","DEALER_TT","DLC_TT"]
["TW006259001B","蒲隴空調設備有限公司","23865305","22757557","台中營銷處","台中營銷處","台中","DEALER_TT","DLC_TT","TW006259001B",0,"台中營銷處"]
["TW006263001B","東昇電業行","24650197","37756204","台北營銷處","台北營銷處","台北","DEALER_TT","DLC_TT","TW006263001B",76204,"台北營銷處"]
["TW006271001B","上晟國際有限公司","19770112","53335223","ETC","ETC","ETC","ETC","ETC_TT",null,0]
["TW006273001B","新麗電器有限公司","XXXXXXXX","XXXXXXXX","ID/SAC Sales","ID/SAC Sales","ID & SAC","B2B_TT","CAC_TT"]
["TW006279001B","GSM GIFT DEMO CODE","XXXXXXXX","XXXXXXXX","行動電話","行動電話","行動電話","GSM_TT","GSM_TT"]
["TW006283001B","永成電器行","19620402","06169551","嘉南營銷處","嘉南營銷處","嘉南","DEALER_TT","DCS_TT","TW006283001B",58834,"嘉南營銷處"]
["TW006285001B","尚亨電器有限公司","TW006285","53632743","台中營銷處","台中營銷處","台中","DEALER_TT","DLC_TT","TW006285001B",98007,"台中營銷處"]
["TW006286001B","好市多股份有限公司物流分公司","96972798","96972798","MMCS-好市多","好市多","MMCS","MMCS_COSTCO","MMC_TT","TW006286001B",38736686,"連鎖量販-OTHERS"]
["TW006303001B","好市多股份有限公司嘉義分公司","96972798","96972798","MMCS-好市多","好市多","MMCS","MMCS_COSTCO","MMC_TT",null,null,"連鎖量販-OTHERS"]
["TW006312001B","迎春實業股份有限公司","XXXXXXXX","XXXXXXXX","ID/SAC Sales","ID/SAC Sales","ID & SAC","B2B_TT","CAC_TT"]
["TW006319001B","展碁國際股份有限公司","20773257","20773257","ETC","ETC","ETC","IT_TT","ETC_TT","TW006319001B",6060650,"ETC"]
["TW006320001B","小楊家電行","19711028","37912900","台北營銷處","台北營銷處","台北","DEALER_TT","SPD_TT","TW006320001B",4100276,"台北營銷處"]
["TW006332001B","萊旺電器行","73109058","38688177","高屏營銷處","高屏營銷處","高屏","DEALER_TT","SPD_TT","TW006332001B",2525064,"高屏營銷處"]
["TW006336001B","一甲電器行","19660827","78438886","嘉南營銷處","嘉南營銷處","嘉南","DEALER_TT","DCS_TT","TW006336001B",126726,"嘉南營銷處"]
["TW006343001B","動感數位行銷股份有限公司","XXXXXXXX","XXXXXXXX","B2B2C","B2B2C","B2B2C","B2B_TT","B2B_TT",null,0]
["TW006348001B","台灣莫里斯國際股份有限公司","XXXXXXXX","XXXXXXXX","台北營銷處","台北營銷處","台北","DEALER_TT","B2B_TT"]
["TW006352001B","行天宮醫療志業醫療財團法人","XXXXXXXX","XXXXXXXX","ID/SAC Sales","ID/SAC Sales","ID & SAC","B2B_TT","CAC_TT"]
["TW006356001B","長餘國際有限公司","16871220","16871220","ID/SAC Sales","ID/SAC Sales","ID & SAC","B2B_TT","CAC_TT"]
["TW006359001B","展碁國際股份有限公司","20773257","20773257","HPC","ONLINE","ONLINE","INT_TT","TW006359001B","TW006359001B",133636824,"ONLINE"]
["TW006360001B","捷元股份有限公司","27956677","23134543","HPC","ONLINE","ONLINE","INT_TT","TW006360001B","TW006360001B",67750,"ONLINE"]
["TW006379001B","東洋電器行","TW006379","38881356","台中營銷處","台中營銷處","台中","DEALER_TT","SPD_TT","TW006379001B",1086526,"台中營銷處"]
["TW006381001B","百恆威實業有限公司","XXXXXXXX","XXXXXXXX","ID/SAC Sales","ID/SAC Sales","ID & SAC","B2B_TT","CAC_TT"]
["TW006387001B","晁碁科技股份有限公司","XXXXXXXX","XXXXXXXX","ID/SAC Sales","ID/SAC Sales","ID & SAC","B2B_TT","CAC_TT"]
["TW006388001B","白雪電器行","19860126","78161918","台中營銷處","台中營銷處","台中","DEALER_TT","DLC_TT"]
["TW006399001B","住屋室內裝修工程有限公司","XXXXXXXX","XXXXXXXX","ID/SAC Sales","ID/SAC Sales","ID & SAC","B2B_TT","CAC_TT"]
["TW006404001B","精傑","23597868","27915502","行動電話","行動電話","行動電話","GSM_TT","GSM_TT","TW006404001B",null,"行動電話 "]
["TW006406001B","佳績家電生活館","TW006406","38853653","台中營銷處","台中營銷處","台中","DEALER_TT","DCS_TT","TW006406001B",400500,"台中營銷處"]
["TW006409001B","特家麗企業有限公司鹿港分公司","TW006409","24648823","台中營銷處","台中營銷處","台中","DEALER_TT","SPD_TT","TW006409001B",1559443,"台中營銷處"]
["TW006412001B","大潤發流通事業股份有限公司新竹分公司","97165560","97165560","MMCS-大潤發","大潤發","MMCS","MMCS_RT","MMC_TT","TW006412001B",45631,"大潤發"]
["TW006414001B","凱晶音響","19671223","40726161","嘉南營銷處","嘉南營銷處","嘉南","DEALER_TT","DLC_TT","TW006414001B",null,"嘉南營銷處"]
["TW006417001B","藍青國際股份有限公司","XXXXXXXX","XXXXXXXX","SAC Sales","SAC Sales","SAC Sales","B2B_TT","CAC_TT","TW006417001B",2952128,"SAC sales Team"]
["TW006422001B","傑笙音響有限公司","TW006422","24823510","台中營銷處","台中營銷處","台中","DEALER_TT","DLC_TT"]
["TW006428001B","高詮電器行","19720727","36732789","高屏營銷處","高屏營銷處","高屏","DEALER_TT","DLC_TT","TW006428001B",137028,"高屏營銷處"]
["TW006436001B","瑞騏實業有限公司","19770322","24678229","高屏營銷處","高屏營銷處","高屏","DEALER_TT","DLC_TT","TW006436001B",29797,"高屏營銷處"]
["TW006439001B","依風企業有限公司","XXXXXXXX","XXXXXXXX","ID/SAC Sales","ID/SAC Sales","ID & SAC","B2B_TT","CAC_TT"]
["TW006440001B","諾亞媒體股份有限公司","XXXXXXXX","XXXXXXXX","ID/SAC Sales","ID/SAC Sales","ID & SAC","B2B_TT","CAC_TT","TW006440001B",null,"ID Sales Team"]
["TW006497001B","摩斯電訊科技有限公司","19760426","28408161","行動電話","行動電話","行動電話","GSM_TT","GSM_TT"]
["TW006498001B","仲昌通訊有限公司","54512957","19910601","行動電話","行動電話","行動電話","GSM_TT","GSM_TT","TW006498001B",17145916,"行動電話 "]
["TW006531001B","地標電通有限公司","28824531","33933898","行動電話","行動電話","行動電話","GSM_TT","GSM_TT","TW006531001B",null,"行動電話 "]
["TW006575001B","台灣櫻花股份有限公司 ","XXXXXXXX","XXXXXXXX","台北營銷處","台北營銷處","台北","DEALER_TT","DLC_TT"]
["TW006668001B","好市多股份有限公司中壢分公司","96972798","96972798","MMCS-好市多","好市多","MMCS","MMCS_COSTCO","MMC_TT",null,null,"連鎖量販-OTHERS"]
["TW006683001B","躍動科技有限公司","38621940","12590845","行動電話","行動電話","行動電話","GSM_TT","GSM_TT"]
["TW006686001B","軒誠有限公司","19700206","24972047","台北營銷處","台北營銷處","台北","DEALER_TT","DLC_TT"]
["TW006695001B","日華金典國際酒店股份有限公司 ","XXXXXXXX","XXXXXXXX","台北營銷處","台北營銷處","台北","DEALER_TT","B2B_TT"]
["TW006699001B","首豐企業社","19660206","28707322","高屏營銷處","高屏營銷處","高屏","DEALER_TT","DLC_TT","TW006699001B",48369,"高屏營銷處"]
["TW006704001B","興達發電廠","XXXXXXXX","XXXXXXXX","ID/SAC Sales","ID/SAC Sales","ID & SAC","B2B_TT","CAC_TT"]
["TW006780001B","全宏家電有限公司","19781026","42673865","台中營銷處","台中營銷處","台中","DEALER_TT","DCS_TT","TW006780001B",39076,"台中營銷處"]
["TW006812001B","國際極品科技有限公司","19890322","28572330","ID/SAC Sales","ID/SAC Sales","ID & SAC","B2B_TT","CAC_TT"]
["TW006816001B","音匠音響實業社","XXXXXXXX","XXXXXXXX","ID/SAC Sales","ID/SAC Sales","ID & SAC","B2B_TT","CAC_TT"]
["TW006822001B","豪鑫電機有限公司","19600820","28902634","ID/SAC Sales","ID/SAC Sales","ID & SAC","B2B_TT","CAC_TT"]
["TW006823001B","米米實業有限公司","19871113","53821717","台中營銷處","台中營銷處","台中","DEALER_TT","SPD_TT","TW006823001B",17251251,"台中營銷處"]
["TW006824001B","依風企業有限公司","54305492","54305492","ID/SAC Sales","ID/SAC Sales","ID & SAC","B2B_TT","CAC_TT"]
["TW006825001B","中榮音響實業社","19611107","13661469","ID/SAC Sales","ID/SAC Sales","ID & SAC","B2B_TT","CAC_TT"]
["TW006826001B","華厚股份有限公司","XXXXXXXX","XXXXXXXX","ID/SAC Sales","ID/SAC Sales","ID & SAC","B2B_TT","CAC_TT"]
["TW006827001B","歐雅系統設計有限公司 ","XXXXXXXX","XXXXXXXX","B2B2C","B2B2C","B2B2C","B2B_TT","B2B_TT",null,48000,"B2B2C(B2B2C Part)"]
["TW006828001B","好市多股份有限公司北投分公司","96972798","96972798","MMCS-好市多","好市多","MMCS","MMCS_COSTCO","MMC_TT",null,null,"連鎖量販-OTHERS"]
["TW006829001B","統匯電器有限公司","19660310","42677356","台中營銷處","台中營銷處","台中","DEALER_TT","DLC_TT"]
["TW006830001B","富基電通股份有限公司","XXXXXXXX","XXXXXXXX","B2B2C","B2B2C","B2B2C","B2B_TT","B2B_TT","TW006830001B",5058892,"B2B2C(B2B2C Part)"]
["TW006831001B","富基電通股份有限公司","27888099","27525541","HPC","ONLINE","ONLINE","INT_TT","TW006831001B"]
["TW006833001B","八ㄚ旺實業有限公司","XXXXXXXX","XXXXXXXX","ID/SAC Sales","ID/SAC Sales","ID & SAC","B2B_TT","CAC_TT"]
["TW006834001B","世雍國際股份有限公司 ","27808941","53434167","行動電話","行動電話","行動電話","GSM_TT","GSM_TT",null,null,"行動電話 "]
["TW006835001B","嘉豐電器有限公司","19560822","19560822","台北營銷處","台北營銷處","台北","DEALER_TT","SPD_TT","TW006835001B",1976345,"台北營銷處"]
["TW006836001B","華航大飯店股份有限公司","XXXXXXXX","XXXXXXXX","ID/SAC Sales","ID/SAC Sales","ID & SAC","B2B_TT","CAC_TT"]
["TW006837001B","東亞電業有限公司 ","19850208","42878950","台中營銷處","台中營銷處","台中","DEALER_TT","DCS_TT","TW006837001B",384714,"台中營銷處"]
["TW006840001B","鼎極家電有限公司 ","19791110","42877410","台中營銷處","台中營銷處","台中","DEALER_TT","DCS_TT","TW006840001B",0,"台中營銷處"]
["TW006857001B","誠鴻電器有限公司","19730122","45097205","台北營銷處","台北營銷處","台北","DEALER_TT","SPD_TT","TW006857001B",3188217,"台北營銷處"]
["TW006863001B","台灣樂金化學股份有限公司台中分公司","XXXXXXXX","XXXXXXXX","台北營銷處","台北營銷處","台北","ETC","ETC_TT"]
["TW006865001B","誠鴻電器有限公司","XXXXXXXX","XXXXXXXX","ID/SAC Sales","ID/SAC Sales","ID & SAC","B2B_TT","CAC_TT"]
["TW006866001B","視紀音響有限公司","19630131","45101708","桃竹營銷處","桃竹營銷處","桃竹","DEALER_TT","DLC_TT"]
["TW006869001B","雅光有限公司","XXXXXXXX","XXXXXXXX","ETC","ETC","ETC","ETC","ETC_TT","TW006869001B",0,"ETC"]
["TW006874001B","宇宸國際有限公司","XXXXXXXX","XXXXXXXX","B2B2C","B2B2C","B2B2C","B2B_TT","B2B_TT","TW006874001B",24000,"B2B2C(B2B2C Part)"]
["TW006878001B","晉城有限公司","19781217","28106258","台北營銷處","台北營銷處","台北","DEALER_TT","DLC_TT"]
["TW006880003B","協益電子股份有限公司","XXXXXXXX","XXXXXXXX","ETC","ETC","ETC","ETC","ETC_TT","TW006880003B",46540399,"ETC"]
["TW006881001B","柯達大飯店股份有限公司天津分公司","XXXXXXXX","XXXXXXXX","ID/SAC Sales","ID/SAC Sales","ID & SAC","B2B_TT","CAC_TT"]
["TW006884001B","金禾行銷有限公司","19811015","42848181","台北營銷處","台北營銷處","台北","DEALER_TT","DCS_TT"]
["TW006887001B","綠光國際科技有限公司","XXXXXXXX","XXXXXXXX","ID/SAC Sales","ID/SAC Sales","ID & SAC","B2B_TT","CAC_TT"]
["TW006891002B","梅山安順電器企業有限公司","XXXXXXXX","XXXXXXXX","ID/SAC Sales","ID/SAC Sales","ID & SAC","B2B_TT","CAC_TT"]
["TW006897001B","姿芳科技有限公司","19710111","42770901","桃竹營銷處","桃竹營銷處","桃竹","DEALER_TT","SPD_TT","TW006897001B",9622308,"桃竹營銷處"]
["TW006897002B","姿芳科技有限公司","19710111","42770901","B2B2C","B2B2C","B2B2C","B2B_TT","B2B_TT",null,null,"B2B2C(B2B2C Part)"]
["TW006907001B","好市多股份有限公司新莊分公司","96972798","96972798","MMCS-好市多","好市多","MMCS","MMCS_COSTCO","MMC_TT",null,null,"連鎖量販-OTHERS"]
["TW006908001B","侑來有限公司","19720813","89695030","台中營銷處","台中營銷處","台中","DEALER_TT","DLC_TT","TW006908001B",11225,"台中營銷處"]
["TW006911001B","冠成家電有限公司","19690906","25852940","台中營銷處","台中營銷處","台中","DEALER_TT","DLC_TT","TW006911001B",0,"台中營銷處"]
["TW006916001B","上洋產業股份有限公司","XXXXXXXX","XXXXXXXX","ID/SAC Sales","ID/SAC Sales","ID & SAC","B2B_TT","CAC_TT"]
["TW006917001B","佳瑩科技有限公司","19580310","53282350","桃竹營銷處","桃竹營銷處","桃竹","DEALER_TT","DLC_TT","TW006917001B",1728726,"桃竹營銷處"]
["TW006919001B","福貓微創系統有限公司","19780505","42682457","台中營銷處","台中營銷處","台中","DEALER_TT","DLC_TT"]
["TW006921001B","宸逸企業社","19860526","41318298","高屏營銷處","高屏營銷處","高屏","DEALER_TT","DCS_TT"]
["TW006924001B","千代工程有限公司","80097391","80097391","ID/SAC Sales","ID/SAC Sales","ID & SAC","B2B_TT","CAC_TT"]
["TW006925001B","毅鴻電器有限公司","19630406","55952158","台中營銷處","台中營銷處","台中","DEALER_TT","DLC_TT","TW006925001B",233954,"台中營銷處"]
["TW006926001B","柯達大飯店股份有限公司長安分公司","XXXXXXXX","XXXXXXXX","ID/SAC Sales","ID/SAC Sales","ID & SAC","B2B_TT","CAC_TT"]
["TW006930001B","華音音響店","19840228","40582504","嘉南營銷處","嘉南營銷處","嘉南","DEALER_TT","DLC_TT","TW006930001B",null,"嘉南營銷處"]
["TW006935001B","麗歌數位影音科技有限公司","19610201","27367557","HPC","ONLINE","ONLINE","INT_TT","TW006935001B","TW006935001B",17998421,"ONLINE"]
["TW006937001B","浩宇資訊社","93851960","93851960","ID/SAC Sales","ID/SAC Sales","ID & SAC","B2B_TT","CAC_TT"]
["TW006939001B","香港商傲視科技有限公司台灣分公司","XXXXXXXX","XXXXXXXX","ID/SAC Sales","ID/SAC Sales","ID & SAC","B2B_TT","CAC_TT"]
["TW006941001B","新傑電器有限公司","19540819","12749635","ID/SAC Sales","ID/SAC Sales","ID & SAC","B2B_TT","CAC_TT"]
["TW006943001B","柏碩電器行","19901127","83885575","桃竹營銷處","桃竹營銷處","桃竹","DEALER_TT","DCS_TT","TW006943001B",73557,"桃竹營銷處"]
["TW006945001B","大旺電子有限公司","19680416","84965479","ID/SAC Sales","ID/SAC Sales","ID & SAC","B2B_TT","CAC_TT"]
["TW006946001B","合和國際股份有限公司 ","XXXXXXXX","XXXXXXXX","ID/SAC Sales","ID/SAC Sales","ID & SAC","B2B_TT","CAC_TT"]
["TW006948001B","全國電子股份有限公司","XXXXXXXX","XXXXXXXX","行動電話","行動電話","行動電話","GSM_TT","MMCS_E-LIFE"]
["TW006950001B","福得數位科技有限公司 ","XXXXXXXX","XXXXXXXX","ID/SAC Sales","ID/SAC Sales","ID & SAC","B2B_TT","CAC_TT"]
["TW006953001B","屏東縣里港鄉玉田國民小學","XXXXXXXX","XXXXXXXX","ID/SAC Sales","ID/SAC Sales","ID & SAC","B2B_TT","CAC_TT"]
["TW006954001B","西華大飯店股份有限公司","XXXXXXXX","XXXXXXXX","ID/SAC Sales","ID/SAC Sales","ID & SAC","B2B_TT","CAC_TT"]
["TW006958001B","宇宸國際有限公司汐止遠雄館","XXXXXXXX","XXXXXXXX","B2B2C","B2B2C","B2B2C","B2B_TT","B2B_TT","TW006958001B",null,"B2B2C(B2B2C Part)"]
["TW006959001B","明昇電器有限公司","69481904","69481904","桃竹營銷處","桃竹營銷處","桃竹","DEALER_TT","DLC_TT"]
["TW006960001B","廣迅媒體數位科技有限公司","19820924","24469721","台中營銷處","台中營銷處","台中","DEALER_TT","DLC_TT"]
["TW006962001B","歐寶櫥櫃有限公司","28209682","28209682","台北營銷處","台北營銷處","台北","DEALER_TT","DLC_TT"]
["TW006963001B","怡菱電器有限公司","19541001","84568627","桃竹營銷處","桃竹營銷處","桃竹","DEALER_TT","DLC_TT"]
["TW006964001B","泓信電器工程有限公司","19560820","28559580","ID/SAC Sales","ID/SAC Sales","ID & SAC","B2B_TT","CAC_TT"]
["TW006976001B","廣迅媒體數位科技有限公司","19820924","24469721","ID Sales","ID Sales","ID Sales"]
["TW006978001B","宏鼎電腦有限公司","XXXXXXXX","XXXXXXXX","ID/SAC Sales","ID/SAC Sales","ID & SAC","B2B_TT","CAC_TT"]
["TW006980001B","集雅社股份有限公司","89266170","89266170","ID Sales","ID Sales","ID Sales"]
["TW006981001B","勁波影音工程行","19770811","40718991","嘉南營銷處","嘉南營銷處","嘉南","DEALER_TT","DLC_TT",null,0]
["TW006982001B","慶檳系統多媒體股份有限公司","XXXXXXXX","XXXXXXXX","ID/SAC Sales","ID/SAC Sales","ID & SAC","B2B_TT","CAC_TT"]
["TW006985001B","宸逸有限公司","64875513","64875513","嘉南營銷處","嘉南營銷處","嘉南","DEALER_TT","DLC_TT"]
["TW006987001B","億電通國際股份有限公司","XXXXXXXX","XXXXXXXX","行動電話","行動電話","行動電話","GSM_TT","GSM_TT","TW006987001B",null,"行動電話 "]
["TW006989001B","蓁讚國際股份有限公司","19740104","53411988","台北營銷處","台北營銷處","台北","DEALER_TT","DLC_TT"]
["TW006992001B","大潤發流通事業股份有限公司雙十分公司","97165560","97165560","MMCS-大潤發","大潤發","MMCS","MMCS_RT","MMC_TT"]
["TW006996001B","頂尖空調工程有限公司","20510406","69629961","桃竹營銷處","桃竹營銷處","桃竹","DEALER_TT","DLC_TT","TW006996001B",2155,"桃竹營銷處"]
["TW006997001B","吉運有限公司","19650711","69703862","桃竹營銷處","桃竹營銷處","桃竹","DEALER_TT","DLC_TT","TW006997001B",0,"桃竹營銷處"]
["TW006999001B","北門電器有限公司","XXXXXXXX","XXXXXXXX","ID/SAC Sales","ID/SAC Sales","ID & SAC","B2B_TT","CAC_TT"]
["TW007001001B","前線媒體股份有限公司","XXXXXXXX","XXXXXXXX","ID/SAC Sales","ID/SAC Sales","ID & SAC","B2B_TT","CAC_TT"]
["TW007002001B","宜耀國際有限公司","19640324","52594313","ID/SAC Sales","ID/SAC Sales","ID & SAC","B2B_TT","CAC_TT"]
["TW007003001B","東家電器行","19860419","72388065","台中營銷處","台中營銷處","台中","DEALER_TT","SPD_TT","TW007003001B",311645,"台中營銷處"]
["TW007004001B","信裕冷氣行","19600203","42103295","台北營銷處","台北營銷處","台北","DEALER_TT","DLC_TT","TW007004001B"]
["TW007005001B","一清電器行","19720317","20198331","嘉南營銷處","嘉南營銷處","嘉南","DEALER_TT","DCS_TT"]
["TW007006001B","富豪音響影視企業社","19630220","13911608","高屏營銷處","高屏營銷處","高屏","DEALER_TT","DLC_TT","TW007006001B",184279,"高屏營銷處"]
["TW007007001B","山淬有限公司","19721004","53563181","HPC","ONLINE","ONLINE","INT_TT","TW007007001B","TW007007001B",4105374,"ONLINE"]
["TW007008001B","晙拓空調企業社","19810405","37838304","台北營銷處","台北營銷處","台北","DEALER_TT","DLC_TT","TW007008001B",0,"台北營銷處"]
["TW007009001B","杰蓉有限公司","19670917","55671452","SVC","SVC","SVC","SVC","SVC",null,0]
["TW007011001B","昱承資訊有限公司","19850904","42804228","高屏營銷處","高屏營銷處","高屏","DEALER_TT","DLC_TT",null,0,"高屏營銷處"]
["TW007012001B","慧友電子股份有限公司","XXXXXXXX","XXXXXXXX","ID/SAC Sales","ID/SAC Sales","ID & SAC","B2B_TT","CAC_TT"]
["TW007013001B","稻草人科技有限公司","XXXXXXXX","XXXXXXXX","ID/SAC Sales","ID/SAC Sales","ID & SAC","B2B_TT","CAC_TT"]
["TW007013002B","稻草人科技有限公司","XXXXXXXX","XXXXXXXX","台北營銷處","台北營銷處","台北","DEALER_TT","B2B_TT"]
["TW007015001B","耕薪都市更新股份有限公司","XXXXXXXX","XXXXXXXX","ID/SAC Sales","ID/SAC Sales","ID & SAC","B2B_TT","CAC_TT"]
["TW007016001B","富信人電器有限公司","XXXXXXXX","XXXXXXXX","ID/SAC Sales","ID/SAC Sales","ID & SAC","B2B_TT","CAC_TT"]
["TW007017001B","遠閎五金企業社","19820920","34977176","嘉南營銷處","嘉南營銷處","嘉南","DEALER_TT","DLC_TT"]
["TW007019001B","萊爾富國際股份有限公司","XXXXXXXX","XXXXXXXX","ID/SAC Sales","ID/SAC Sales","ID & SAC","B2B_TT","CAC_TT"]
["TW007020001B","大買客電器事業有限公司","19561116","63679302","台中營銷處","台中營銷處","台中","DEALER_TT","DLC_TT","TW007020001B",null,"台中營銷處"]
["TW007022001B","巧豐資訊股份有限公司","19700515","86600025","ID/SAC Sales","ID/SAC Sales","ID & SAC","B2B_TT","CAC_TT"]
["TW007023001B","聖家商行","19800421","10980411","台中營銷處","台中營銷處","台中","DEALER_TT","DLC_TT"]
["TW007024001B","佳昇電器行","19840403","47548661","台中營銷處","台中營銷處","台中","DEALER_TT","DLC_TT","TW007024001B",102731,"台中營銷處"]
["TW007025001B","旺星電器行","19810220","25904905","高屏營銷處","高屏營銷處","高屏","DEALER_TT","DLC_TT"]
["TW007026001B","友誠汽車行","19811010","77255466","高屏營銷處","高屏營銷處","高屏","DEALER_TT","DCS_TT","TW007026001B",430122,"高屏營銷處"]
["TW007027001B","前鉅數位股份有限公司","19851101","80097391","ID/SAC Sales","ID/SAC Sales","ID & SAC","B2B_TT","CAC_TT"]
["TW007028001B","龍吉電器行","19920929","26663572","桃竹營銷處","桃竹營銷處","桃竹","DEALER_TT","DLC_TT"]
["TW007029001B","國泰健康管理顧問股份有限公司","XXXXXXXX","XXXXXXXX","台北營銷處","台北營銷處","台北","DEALER_TT","DLC_TT"]
["TW007030001B","蒼松科技有限公司","19600805","53169744","ID/SAC Sales","ID/SAC Sales","ID & SAC","B2B_TT","CAC_TT"]
["TW007031001B","良興股份有限公司","XXXXXXXX","XXXXXXXX","HPC","IT","IT","IT_TT","IT_TT"]
["TW007032001B","台灣奇茂資訊有限公司","XXXXXXXX","XXXXXXXX","HPC","IT","IT","IT_TT","IT_TT"]
["TW007033001B","東榮通信有限公司","19620102","22844026","高屏營銷處","高屏營銷處","高屏","DEALER_TT","DLC_TT"]
["TW007034001B","黃金林企業有限公司","19860526","59202734","高屏營銷處","高屏營銷處","高屏","DEALER_TT","DCS_TT"]
["TW007035001B","展碁國際股份有限公司","20773257","20773257","行動電話","行動電話","行動電話","GSM_TT","IT_TT"]
["TW007036001B","勝源電器有限公司 ","19730212","66578989","台北營銷處","台北營銷處","台北","DEALER_TT","DCS_TT"]
["TW007037001B","鯨硯資訊有限公司","19760821","42749577","桃竹營銷處","桃竹營銷處","桃竹","DEALER_TT","DLC_TT"]
["TW007038001B","阿仔企業社","19811125","37597380","嘉南營銷處","嘉南營銷處","嘉南","DEALER_TT","DLC_TT"]
["TW007042001B","韓美半導體股份有限公司","XXXXXXXX","XXXXXXXX","台北營銷處","台北營銷處","台北","DEALER_TT","DLC_TT"]
["TW007044001B","泰梭企業社","19600916","72909993","台北營銷處","台北營銷處","台北","DEALER_TT","DCS_TT"]
["TW007045001B","谷森通信有限公司","19790521","24906835","嘉南營銷處","嘉南營銷處","嘉南","DEALER_TT","DLC_TT"]
["TW007046001B","和群室內裝修股份有限公司","XXXXXXXX","XXXXXXXX","ID/SAC Sales","ID/SAC Sales","ID & SAC","B2B_TT","CAC_TT"]
["TW007047001B","宏騰興企業有限公司","19681030","42996817","台北營銷處","台北營銷處","台北","DEALER_TT","DLC_TT","TW007047001B",561115,"台北營銷處"]
["TW007048001B","凱筌視聽工程有限公司","XXXXXXXX","XXXXXXXX","ID/SAC Sales","ID/SAC Sales","ID & SAC","B2B_TT","CAC_TT"]
["TW007050001B","昭強電器有限公司","19570224","23106342","台中營銷處","台中營銷處","台中","DEALER_TT","DLC_TT"]
["TW007051001B","捷達光電股份有限公司","XXXXXXXX","XXXXXXXX","ID/SAC Sales","ID/SAC Sales","ID & SAC","B2B_TT","CAC_TT"]
["TW007052001B","倉泉有限公司 ","19650418","50820777","台中營銷處","台中營銷處","台中","DEALER_TT","DLC_TT","TW007052001B",26567,"台中營銷處"]
["TW007053001B","尚合雅有限公司","19741112","59289719","高屏營銷處","高屏營銷處","高屏","DEALER_TT","DLC_TT","TW007053001B",2983315,"高屏營銷處"]
["TW007054001B","穿越九千公里交給你企業社","XXXXXXXX","XXXXXXXX","台北營銷處","台北營銷處","台北","DEALER_TT","DLC_TT"]
["TW007055001B","香港商科傳系統有限公司台灣分公司","XXXXXXXX","XXXXXXXX","ID/SAC Sales","ID/SAC Sales","ID & SAC","B2B_TT","CAC_TT"]
["TW007056001B","正義電器行","19900206","7940990","高屏營銷處","高屏營銷處","高屏","DEALER_TT","DLC_TT","TW007056001B",105646,"高屏營銷處"]
["TW007057001B","允丞電器有限公司","19690927","28615181","高屏營銷處","高屏營銷處","高屏","DEALER_TT","DLC_TT"]
["TW007058001B","東緣電器行","19311028","72794774","桃竹營銷處","桃竹營銷處","桃竹","DEALER_TT","SPD_TT","TW007058001B",1516375,"桃竹營銷處"]
["TW007059001B","*","XXXXXXXX","XXXXXXXX","B2B2C","B2B2C","B2B2C","B2B_TT","B2B_TT",null,0]
["TW007060001B","富基電通股份有限公司","XXXXXXXX","XXXXXXXX","ID Sales","ID Sales","ID Sales",null,null,"TW007060001B",101220,"ID Sales Team"]
["TW007061001B","立欣電器行","19690118","10255924","高屏營銷處","高屏營銷處","高屏","DEALER_TT","DLC_TT","TW007061001B",0,"高屏營銷處"]
["TW007062001B","美商蘋果亞洲股份有限公司台灣分公司","XXXXXXXX","XXXXXXXX","HPC","IT","IT","IT_TT","IT_TT","TW007062001B",841680,"IT"]
["TW007063001B","亞迅科技股份有限公司","19621024","80081948","ID/SAC Sales","ID/SAC Sales","ID & SAC","B2B_TT","CAC_TT"]
["TW007064001B","豐穗國際股份有限公司","XXXXXXXX","XXXXXXXX","台北營銷處","台北營銷處","台北","DEALER_TT","DLC_TT"]
["TW007065001B","華音電氣行","XXXXXXXX","XXXXXXXX","台北營銷處","台北營銷處","台北","DEALER_TT","DLC_TT"]
["TW007066001B","富士實業有限公司","XXXXXXXX","XXXXXXXX","台北營銷處","台北營銷處","台北","DEALER_TT","DLC_TT"]
["TW007067001B","燦坤實業股份有限公司","19841224","69568009","HPC","IT","IT","IT_TT","IT_TT","TW007067001B",3986640,"IT"]
["TW007068001B","寓丞家電行","19780726","47957074","嘉南營銷處","嘉南營銷處","嘉南","DEALER_TT","DLC_TT","TW007068001B",0,"嘉南營銷處"]
["TW007069001B","森呼吸親子館","XXXXXXXX","XXXXXXXX","台北營銷處","台北營銷處","台北","DEALER_TT","DLC_TT"]
["TW007070001B","德侑股份有限公司","XXXXXXXX","XXXXXXXX","台北營銷處","台北營銷處","台北","DEALER_TT","DLC_TT"]
["TW007071001B","吉成電器有限公司","19770813","29028359","高屏營銷處","高屏營銷處","高屏","DEALER_TT","DLC_TT"]
["TW007072001B","韓台有限公司","19630724","59128355","台北營銷處","台北營銷處","台北","DEALER_TT","DLC_TT"]
["TW007073001B","亞太電信股份有限公司","20000505","70771579","行動電話","行動電話","行動電話","GSM_TT","GSM_TT"]
["TW007074001B","新秀國際企業有限公司","19660107","50968912","台北營銷處","台北營銷處","台北","DEALER_TT","SPD_TT","TW007074001B",432845,"台北營銷處"]
["TW007075001B","台灣矽漫科技工程顧問有限公司","XXXXXXXX","XXXXXXXX","ID/SAC Sales","ID/SAC Sales","ID & SAC","B2B_TT","CAC_TT"]
["TW007076001B","人因生技有限公司","XXXXXXXX","XXXXXXXX","台北營銷處","台北營銷處","台北","DEALER_TT","DLC_TT"]
["TW007077001B","宸欣工程行","19930306","38824736","台中營銷處","台中營銷處","台中","DEALER_TT","DLC_TT"]
["TW007079001B","維春商業開發股份有限公司忠孝分公司","XXXXXXXX","XXXXXXXX","台北營銷處","台北營銷處","台北","DEALER_TT","DLC_TT"]
["TW007080001B","喬大電機股份有限公司","19581201","80040503","嘉南營銷處","嘉南營銷處","嘉南","DEALER_TT","DLC_TT","TW007080001B",22083,"嘉南營銷處"]
["TW007081001B","瑞網股份有限公司","XXXXXXXX","XXXXXXXX","台北營銷處","台北營銷處","台北","DEALER_TT","DLC_TT"]
["TW007082001B","勝興電器行","XXXXXXXX","XXXXXXXX","高屏營銷處","高屏營銷處","高屏","DEALER_TT","DLC_TT"]
["TW007083001B","大潤發流通事業股份有限公司員林分公司","97165560","97165560","MMCS-大潤發","大潤發","MMCS","MMCS_RT","MMC_TT","TW007083001B",null,"大潤發"]
["TW007084001B","理想人生櫥櫃實業有限公司","XXXXXXXX","XXXXXXXX","台北營銷處","台北營銷處","台北","DEALER_TT","DLC_TT"]
["TW007085001B","華碩電器行","19700810","20198640","嘉南營銷處","嘉南營銷處","嘉南","DEALER_TT","DCS_TT","TW007085001B",56364,"嘉南營銷處"]
["TW007086001B","正育電器有限公司","19790715","70629670","桃竹營銷處","桃竹營銷處","桃竹","DEALER_TT","DLC_TT","TW007086001B",null,"桃竹營銷處"]
["TW007087001B","振瓏電器行","19881011","40885358","嘉南營銷處","嘉南營銷處","嘉南","DEALER_TT","DLC_TT","TW007087001B",65140,"嘉南營銷處"]
["TW007088001B","佑亮貿易有限公司","19540307","89754136","高屏營銷處","高屏營銷處","高屏","DEALER_TT","DLC_TT"]
["TW007089001B","藍天企業社","19780816","36851026","高屏營銷處","高屏營銷處","高屏","DEALER_TT","DLC_TT","TW007089001B",null,"高屏營銷處"]
["TW007090001B","鴻郁電器工程有限公司","XXXXXXXX","XXXXXXXX","桃竹營銷處","桃竹營銷處","桃竹","DEALER_TT","DLC_TT","TW007090001B",0,"桃竹營銷處"]
["TW007091001B","鑫萬能企業社","19870206","37684856","高屏營銷處","高屏營銷處","高屏","DEALER_TT","DLC_TT"]
["TW007092001B","摩曼頓企業股份有限公司","XXXXXXXX","XXXXXXXX","台北營銷處","台北營銷處","台北","DEALER_TT","DLC_TT"]
["TW007093001B","奧森貓國際精品館","XXXXXXXX","XXXXXXXX","台北營銷處","台北營銷處","台北","DEALER_TT","DLC_TT"]
["TW007094001B","遠東空調家電有限公司","19620315","54970664","台北營銷處","台北營銷處","台北","DEALER_TT","DLC_TT","TW007094001B",1373227,"台北營銷處"]
["TW007094002B","遠東空調家電有限公司","19620315","54970664","SAC Sales","SAC Sales","SAC Sales","B2B_TT","CAC_TT","TW007094002B",null,"SAC sales Team"]
["TW007096001B","台灣高沅空調科技股份有限公司","19700705","16023599","台中營銷處","台中營銷處","台中","DEALER_TT","DLC_TT","TW007096001B",45314,"台中營銷處"]
["TW007097001B","萊爾富國際股份有限公司","XXXXXXXX","XXXXXXXX","台北營銷處","台北營銷處","台北","DEALER_TT","B2B_TT"]
["TW007099001B","陸軍工兵訓練中心","XXXXXXXX","XXXXXXXX","ID/SAC Sales","ID/SAC Sales","ID & SAC","B2B_TT","CAC_TT"]
["TW007101001B","宏展數位科技有限公司","XXXXXXXX","XXXXXXXX","台北營銷處","台北營銷處","台北","DEALER_TT","DLC_TT"]
["TW007102001B","頡隆電器行","19821122","47953008","嘉南營銷處","嘉南營銷處","嘉南","DEALER_TT","DLC_TT","TW007102001B",0,"嘉南營銷處"]
["TW007104001B","富庫曼科技有限公司","XXXXXXXX","XXXXXXXX","ID/SAC Sales","ID/SAC Sales","ID & SAC","B2B_TT","CAC_TT"]
["TW007105001B","澄洽企業","19791030","80464620","桃竹營銷處","桃竹營銷處","桃竹","DEALER_TT","DLC_TT","TW007105001B",0,"桃竹營銷處"]
["TW007106001B","駿焺冷氣空調行","19760618","47439050","台中營銷處","台中營銷處","台中","DEALER_TT","DLC_TT","TW007106001B",19397,"台中營銷處"]
["TW007108001B","誠謚家電有限公司","19711119","42885137","台中營銷處","台中營銷處","台中","DEALER_TT","DLC_TT","TW007108001B",34872,"台中營銷處"]
["TW007109001B","大進電器行","19760616","99539143","高屏營銷處","高屏營銷處","高屏","DEALER_TT","DLC_TT","TW007109001B",176712,"高屏營銷處"]
["TW007110001B","佳美百事購有限公司","19830322","42933481","嘉南營銷處","嘉南營銷處","嘉南","DEALER_TT","DLC_TT",null,177299,"嘉南營銷處"]
["TW007111001B","豪順興業有限公司","19890320","50839663","台中營銷處","台中營銷處","台中","DEALER_TT","DLC_TT","TW007111001B",1369543,"台中營銷處"]
["TW007112001B","桂安家電空調","rosa0410","rosa0302","台中營銷處","台中營銷處","台中","DEALER_TT","DLC_TT","TW007112001B",1929040,"台中營銷處"]
["TW007113001B","寶祥音響電器","19821129","78103523","台中營銷處","台中營銷處","嘉南","DEALER_TT","DLC_TT"]
["TW007114001B","日進電器有限公司","19870228","53282268","嘉南營銷處","嘉南營銷處","嘉南","DEALER_TT","DLC_TT","TW007114001B",11225,"嘉南營銷處"]
["TW007115001B","佳新電業有限公司","19820614","42938269","嘉南營銷處","嘉南營銷處","嘉南","DEALER_TT","DLC_TT","TW007115001B",176737,"嘉南營銷處"]
["TW007118001B","鈺陞有限公司","19630910","24297592","台中營銷處","台中營銷處","台中","DEALER_TT","DLC_TT","TW007118001B",1353331,"台中營銷處"]
["TW007119001B","巨源興業有限公司","19730212","16008611","HPC","百貨","百貨","DEALER_DEPT","DEALER_DEPT","TW007119001B",1539724,"百貨"]
["TW007121001B","捷達數位系統","XXXXXXXX","XXXXXXXX","ID/SAC Sales","ID/SAC Sales","ID & SAC","B2B_TT","CAC_TT"]
["TW007122001B","金日興照明有限公司","XXXXXXXX","XXXXXXXX","ID/SAC Sales","ID/SAC Sales","ID & SAC","B2B_TT","CAC_TT"]
["TW007124001B","特力屋股份有限公司","87916668","89390488","MMCS-特力屋","特力屋","MMCS","MMCS_OTHERS","CSC_TT","TW007124001B",6863407,"連鎖量販-OTHERS"]
["TW007127001B","全陽","XXXXXXXX","XXXXXXXX","ID Sales","ID Sales","ID Sales"]
["TW007128001B","立可達電器有限公司","19781027","42763090","嘉南營銷處","嘉南營銷處","嘉南","DEALER_TT","DLC_TT","TW007128001B",null,"嘉南營銷處"]
["TW007129001B","鴻昇電器行","19640531","10880551","嘉南營銷處","嘉南營銷處","嘉南","DEALER_TT","DLC_TT"]
["TW007132001B","一詮冷凍空調工程有限公司","19720102","70668603","嘉南營銷處","嘉南營銷處","嘉南","DEALER_TT","DLC_TT","TW007132001B",null,"嘉南營銷處"]
["TW007133001B","慶豐電器行","19640630","47860037","嘉南營銷處","嘉南營銷處","嘉南","DEALER_TT","DLC_TT","TW007133001B",null,"嘉南營銷處"]
["TW007134001B","威特家電有限公司","19910921","82873609","台中營銷處","台中營銷處","台中","DEALER_TT","DLC_TT","TW007134001B",2132741,"台中營銷處"]
["TW007138001B","丹意企業股份有限公司","19831001","28465401","HPC","百貨","百貨","DEALER_DEPT","DEALER_DEPT","TW007138001B",1272126,"百貨"]
["TW007139001B","可晟有限公司","19760722","23810431","台北營銷處","台北營銷處","台北","DEALER_TT","DLC_TT","TW007139001B",42041,"台北營銷處"]
["TW007140001B","老王科技有限公司","19830623","63306394","台中營銷處","台中營銷處","台中","DEALER_TT","DLC_TT","TW007140001B",3482359,"台中營銷處"]
["TW007141001B","永昇電器行","19660919","98234707","桃竹營銷處","桃竹營銷處","桃竹","DEALER_TT","DLC_TT",null,0,"桃竹營銷處"]
["TW007142001B","欣億冠國際有限公司","19840515","55827820","桃竹營銷處","桃竹營銷處","桃竹","DEALER_TT","DLC_TT","TW007142001B",null,"桃竹營銷處"]
["TW007144001B","安成企業社","19780610","09648367","台中營銷處","台中營銷處","台中","DEALER_TT","DLC_TT","TW007144001B",242817,"台中營銷處"]
["TW007145001B","弘昇電器行","19871018","81021238","高屏營銷處","高屏營銷處","高屏","DEALER_TT","DLC_TT","TW007145001B",234693,"高屏營銷處"]
["TW007146001B","宏昌冷氣工程行","19811206","72518004","台中營銷處","台中營銷處","台中","DEALER_TT","DLC_TT",null,0]
["TW007147001B","益大電器行","19590829","87868062","嘉南營銷處","嘉南營銷處","嘉南","DEALER_TT","DLC_TT","TW007147001B",683860,"嘉南營銷處"]
["TW007148001B","百發商業行","19640202","72737388","桃竹營銷處","桃竹營銷處","桃竹","DEALER_TT","DLC_TT"]
["TW007150001B","柏御企業","19571012","97228354","嘉南營銷處","嘉南營銷處","嘉南","DEALER_TT","DLC_TT"]
["TW007151001B","新祥順","19740523","99374536","嘉南營銷處","嘉南營銷處","嘉南","DEALER_TT","DLC_TT","TW007151001B",null,"嘉南營銷處"]
["TW007152001B","明昌電器行","19571126","64974719","嘉南營銷處","嘉南營銷處","嘉南","DEALER_TT","DLC_TT"]
["TW007153001B","晟達電器行","19720215","76364183","台北營銷處","台北營銷處","台北","DEALER_TT","DLC_TT"]
["TW003485001B","筌豐空調","19661126","80504910","台北營銷處","台北營銷處","台北","DEALER_TT","DLC_TT","TW003485001B",null,"台北營銷處"]
["TW007155001B","銘鎧電器行","19540809","82613560","台中營銷處","台中營銷處","台中","DEALER_TT","DLC_TT",null,null,"台中營銷處"]
["TW007158001B","杉泰電器","19650510","54198731","高屏營銷處","高屏營銷處","高屏","DEALER_TT","DLC_TT","TW007158001B",132204,"高屏營銷處"]
["TW007157001B","日群電業有限公司","19680202","97364218","台北營銷處","台北營銷處","台北","DEALER_TT","DLC_TT","TW007157001B",0,"台北營銷處"]
["TW007159001B","範雅電器行","19660725","21574707","桃竹營銷處","桃竹營銷處","桃竹","DEALER_TT","DLC_TT","TW007159001B",18619,"桃竹營銷處"]
["TW007160001B","聯禾家電服務有限公司","19660208","27783435","嘉南營銷處","嘉南營銷處","嘉南","DEALER_TT","DLC_TT","TW007160001B",null,"嘉南營銷處"]
["TW007161001B","示鎧有限公司",{"$f":"TEXT(19820403,0)","v":"19820403"},"24912153","嘉南營銷處","嘉南營銷處","嘉南","DEALER_TT","DLC_TT","TW007161001B",null,"嘉南營銷處"]
["TW007162001B","良記電器行","10856124","10856124","嘉南營銷處","嘉南營銷處","嘉南","DEALER_TT","DLC_TT","TW007162001B",0,"嘉南營銷處"]
["TW007163001B","三泰電器行","19631025","8495722","高屏營銷處","高屏營銷處","高屏","DEALER_TT","DLC_TT","TW007163001B",null,"高屏營銷處"]
["TW002431002B","一世代電氣行","19620315","18063076","SAC Sales","SAC Sales","SAC Sales","B2B_TT","CAC_TT",null,null,"SAC sales Team"]
["TW002514002B","今漢電器有限公司","19591213","22117460","SAC Sales","SAC Sales","SAC Sales","B2B_TT","CAC_TT",null,0]
["TW002811002B","棋杰電器行","19650706","08016878","SAC Sales","SAC Sales","SAC Sales","B2B_TT","CAC_TT","TW002811002B",117306,"SAC sales Team"]
["TW006168002B","泰川電器行","19550212","31594576","SAC Sales","SAC Sales","SAC Sales","B2B_TT","CAC_TT","TW006168002B",118539,"SAC sales Team"]
["TW002997002B","鎰銘電器有限公司","19670216","80103181","SAC Sales","SAC Sales","SAC Sales","B2B_TT","CAC_TT",null,0,"SAC sales Team"]
["TW004694002B","領侁電器有限公司","19810702","28166558","SAC Sales","SAC Sales","SAC Sales","B2B_TT","CAC_TT"]
["TW006533001B","傑升通信股份有限公司","89908738","29955028","行動電話","行動電話","行動電話","GSM_TT","GSM_TT","TW006533001B",null,"行動電話 "]
["TW007166001B","陽城家電行","19850420","87002223","台中營銷處","台中營銷處","台中","DEALER_TT","DLC_TT","TW007166001B",0,"台中營銷處"]
["TW007167001B","沅瑢","19970404","53379431","台中營銷處","台中營銷處","台中","DEALER_TT","DLC_TT","TW007167001B",22450,"台中營銷處"]
["TW007169001B","翰鉅","19840322","42885988","台中營銷處","台中營銷處","台中","DEALER_TT","DLC_TT","TW007169001B",0,"台中營銷處"]
["TW007174001B","永成電器有限公司","19740301","24881095","桃竹營銷處","桃竹營銷處","桃竹","DEALER_TT","DLC_TT","TW007174001B"]
["TW007175001B","旭崴興業","19750831","59544009","高屏營銷處","高屏營銷處","高屏","DEALER_TT","DLC_TT","TW007175001B",46801,"高屏營銷處"]
["TW007176001B","雨林新零售","19680124","82854547","桃竹營銷處","桃竹營銷處","桃竹","DEALER_TT","DLC_TT","TW007176001B",null,"桃竹營銷處"]
["TW002444002B","台灣電器專賣","XXXXXXXX","XXXXXXXX","SAC Sales","SAC Sales","SAC Sales","B2B_TT","CAC_TT","TW002444002B",null,"SAC sales Team"]
["TW002769003B","東農電器","XXXXXXXX","XXXXXXXX","SAC Sales","SAC Sales","SAC Sales","B2B_TT","CAC_TT","TW002769003B",null,"SAC sales Team"]
["TW003153001B","巧奇電器行","19610819","67792332","台北營銷處","台北營銷處","台北","DEALER_TT","DLC_TT",null,null,"台北營銷處"]
["TW003654001B","群光電子股份有限公司","20200501","20954200","B2B2C","B2B2C","B2B2C","B2B_TT","B2B_TT","TW003654001B",null,"B2B2C(B2B2C Part)"]
["TW007181001B","臻盈股份有限公司","19670314","28858996","台北營銷處","台北營銷處","台北","DEALER_TT","DLC_TT"]
["TW007177001B","九九電器工程","19690714","82881798","高屏營銷處","高屏營銷處","高屏","DEALER_TT","DLC_TT","TW007177001B",0,"高屏營銷處"]
["TW003760002B","德豐電器","19680706","98872660","SAC Sales","SAC Sales","SAC Sales","B2B_TT","CAC_TT","TW003760002B",118539,"SAC sales Team"]
["TW007058002B","東緣電器行","19311028","72794774","SAC Sales","SAC Sales","SAC Sales","B2B_TT","CAC_TT","TW007058002B",null,"SAC sales Team"]
["TW004270001B","駿太科技","19990101","97184807","台中營銷處","台中營銷處","台中","DEALER_TT","DLC_TT","TW007166001B",177550,"台中營銷處"]
["TW002133001B","政興實業有限公司","19571026","74710293","嘉南營銷處","嘉南營銷處","嘉南","DEALER_TT","DLC_TT","TW002133001B",0,"嘉南營銷處"]
["TW006200001B","集盛股份有限公司","19690302","53231867","高屏營銷處","高屏營銷處","高屏","DEALER_TT","DLC_TT","TW006200001B",2290975,"高屏營銷處"]
["TW004122003B","進懋有限","XXXXXXXX","XXXXXXXX","HPC","IT","IT","IT_TT","IT_TT","TW004122003B",null,"IT"]
["TW007192001B","皓藝實業","19910716","82776206","台中營銷處","台中營銷處","台中","DEALER_TT","DLC_TT","TW007192001B",1345949,"台中營銷處"]
["TW006383001B","洪昌企業社","19840530","38835683","台中營銷處","台中營銷處","台中","DEALER_TT","DLC_TT","TW006383001B",508688,"台中營銷處"]
["TW007187001B","欣福益","19840515","24850620","桃竹營銷處","桃竹營銷處","桃竹","DEALER_TT","DLC_TT","TW007187001B",0,"桃竹營銷處"]
["TW007185001B","宏星技研材料股份有限公司","19551212","53092366","HPC","百貨","百貨","DEALER_DEPT","DEALER_DEPT","TW007185001B",1000467,"百貨"]
["TW006084002B","上晟國際","19770112","53335223","SAC Sales","SAC Sales","SAC Sales","B2B_TT","CAC_TT","TW006084002B",null,"SAC sales Team"]
["TW007195001B",{"$f":"[1]總表!B37","v":"中美電器行"},"19870616","92824831","嘉南營銷處","嘉南營銷處","嘉南","DEALER_TT","DLC_TT","TW007195001B",0,"嘉南營銷處"]
["TW006347001B","昱成","19670201","37578905","嘉南營銷處","嘉南營銷處","嘉南","DEALER_TT","DLC_TT","TW006347001B",0,"嘉南營銷處"]
["TW007190001B","強尼電器行","19860526","81459694","嘉南營銷處","嘉南營銷處","嘉南","DEALER_TT","DLC_TT","TW007190001B",24620,"嘉南營銷處"]
["TW007189001B","敬業電器有限公司","19620307","53726615","台北營銷處","台北營銷處","台北","DEALER_TT","DLC_TT","TW007189001B",null,"台北營銷處"]
["TW007211001B","淯麒國際有限公司","19851205","50997276","台北營銷處","台北營銷處","台北","DEALER_TT","DLC_TT","TW007211001B",330720,"台北營銷處"]
["TW007196001B","甫佳有限公司","19550601","23278371","台北營銷處","台北營銷處","台北","DEALER_TT","DLC_TT","TW007196001B",33915,"台北營銷處"]
["TW007184001B","臺南紡織","XXXXXXXX","XXXXXXXX","ID/SAC Sales","ID/SAC Sales","ID & SAC","B2B_TT","CAC_TT","TW007184001B",null,"ID Sales Team"]
["TW007197001B","西北電器行","19570816","66596728","嘉南營銷處","嘉南營銷處","嘉南","DEALER_TT","DLC_TT","TW007197001B",196551,"嘉南營銷處"]
["TW007205001B","金三冷氣空調行","19920726","71212498","高屏營銷處","高屏營銷處","高屏","DEALER_TT","DLC_TT","TW007205001B",66014,"高屏營銷處"]
["TW007209001B","上加實業","TW003805","80604018","台中營銷處","台中營銷處","台中","DEALER_TT","DLC_TT","TW007209001B",18619,"台中營銷處"]
["TW007208001B","新驊科技有限公司","19670830","28918426","HPC","百貨","百貨","DEALER_DEPT","DEALER_DEPT","TW007208001B",0,"百貨"]
["TW007207001B","泳菘水電工程行","19780429","30288108","台北營銷處","台北營銷處","台北","DEALER_TT","DLC_TT","TW007207001B",52802,"台北營銷處"]
["TW007212001B","首鑫家電有限公司","19730325","24672689","高屏營銷處","高屏營銷處","高屏","DEALER_TT","DLC_TT","TW007212001B",17685,"高屏營銷處"]
["TW007203001B","瑪黑家居選物","19791010","50772240","HPC","ONLINE","ONLINE","INT_TT","TW007203001B","TW007203001B",302645,"ONLINE"]
["TW007217001B","三瀛創意營銷有限公司","19961031","52751805","台北營銷處","台北營銷處","台北","DEALER_TT","DLC_TT","TW007217001B",2817969,"台北營銷處"]
["TW005262001B","台灣樂金生活健康","x","x","B2B2C","B2B2C","B2B2C","B2B_TT","B2B_TT","TW005262001B",null,"B2B2C(B2B2C Part)"]
["TW007220001B","星輝企業社","19891028","87122629","台中營銷處","台中營銷處","台中","DEALER_TT","DLC_TT","TW007220001B",446835,"台中營銷處"]
["TW007216001B","正旺電器行","19841202","87349111","台北營銷處","台北營銷處","台北","DEALER_TT","DLC_TT","TW007216001B",0,"台北營銷處"]
["TW007218001B","統揚電器","19650809","28316418","嘉南營銷處","嘉南營銷處","嘉南","DEALER_TT","DLC_TT","TW007218001B",80549,"嘉南營銷處"]
["TW007199001B","美商亞太數位潮流科技台灣分公司",null,null,"ETC","ETC","ETC","ETC","ETC_TT","TW007199001B",3618933,"OBS"]
["TW003182003B","聯強","XXXXXXXX","XXXXXXXX","B2B2C","B2B2C","B2B2C","B2B_TT","B2B_TT","TW003182003B",305704,"B2B2C(B2B2C Part)"]
["TW004466001B","隆豐科技","19510826","27587659","嘉南營銷處","嘉南營銷處","嘉南","DEALER_TT","DLC_TT","TW004466001B",210946,"嘉南營銷處"]
["TW007210001B","鴻佑冷氣","19820529","82493381","台中營銷處","台中營銷處","台中","DEALER_TT","DLC_TT","TW007210001B",0,"台中營銷處"]
["TW005037002B","上隆電器","19550906","22479929","桃竹營銷處","桃竹營銷處","桃竹","DEALER_TT","DLC_TT","TW005037002B",633989,"桃竹營銷處"]
["TW007221001B","立浤冷氣","19801113","42881364","台中營銷處","台中營銷處","台中","DEALER_TT","DLC_TT","TW007221001B",69743,"台中營銷處"]
["TW007176002B","雨林新零售","19680124","82854547","桃竹營銷處","桃竹營銷處","桃竹","DEALER_TT","DLC_TT","TW007176002B",1677153,"桃竹營銷處"]
["TW007227001B","協成電器行","19800507","14764549","嘉南營銷處","嘉南營銷處","嘉南","DEALER_TT","DLC_TT","TW007227001B",169568,"嘉南營銷處"]
["TW007223001B","睿凡企業","19620903","59338514","高屏營銷處","高屏營銷處","高屏","DEALER_TT","DLC_TT","TW007223001B",132566,"高屏營銷處"]
["TW004700002B","鐠羅影音","19661129","09689654","SAC Sales","SAC Sales","SAC Sales","B2B_TT","CAC_TT","TW004700002B",null,"SAC sales Team"]
["TW006200003B","集盛股份有限公司","19690302","53231867","SAC Sales","SAC Sales","SAC Sales","B2B_TT","CAC_TT","TW004700002B",null,"SAC sales Team"]
["TW007238001B","全菱電器","1967","87195930","台中營銷處","台中營銷處","台中","DEALER_TT","DLC_TT","TW007238001B",null,"台中營銷處"]
["TW007228001B","創意電器","19810914","64879638","嘉南營銷處","嘉南營銷處","嘉南","DEALER_TT","DLC_TT","TW007228001B",0,"嘉南營銷處"]
["TW007237001B","尚豪電器","19820728","90808650","嘉南營銷處","嘉南營銷處","嘉南","DEALER_TT","DLC_TT","TW007237001B",20177,"嘉南營銷處"]
["TW002401001B","郁翔電器","19580410","20814341","台北營銷處","台北營銷處","台北","DEALER_TT","DLC_TT","TW002401001B",26346,"台北營銷處"]
["TW007235001B","雄發電器","19820329","23400437","桃竹營銷處","桃竹營銷處","桃竹","DEALER_TT","DLC_TT","TW007235001B",65203,"桃竹營銷處"]
["TW002333001B","駿昌電器","19640201","36414237","桃竹營銷處","桃竹營銷處","桃竹","DEALER_TT","DLC_TT","TW002333001B",56955,"桃竹營銷處"]
["TW007239001B","鴻昇興業行","19880303","85731203","高屏營銷處","高屏營銷處","高屏","DEALER_TT","DLC_TT","TW007239001B",36644,"高屏營銷處"]
["TW007241001B","上順電器行","19800201","36414237","桃竹營銷處","桃竹營銷處","桃竹","DEALER_TT","DLC_TT","TW007241001B",null,"桃竹營銷處"]
["TW004851003B","億電通國際","19680825","27556656","B2B2C","B2B2C","B2B2C","B2B_TT","B2B_TT","TW004851003B",null,"B2B2C(B2B2C Part)"]
["TW007229001B","永承家電量販店","19681110","81855723","高屏營銷處","高屏營銷處","高屏","DEALER_TT","DLC_TT","TW007229001B",0,"高屏營銷處"]
["TW007204001B","源興電器行","19680819","20356062","嘉南營銷處","嘉南營銷處","嘉南","DEALER_TT","DLC_TT","TW007204001B",28228,"嘉南營銷處"]
["TW007230001B","立鼎科技電器有限公司","19771022","53475997","台北營銷處","台北營銷處","台北","DEALER_TT","DLC_TT","TW007230001B",0,"台北營銷處"]
["TW006773001B","集雅社","89266170","89266170","HPC","IT","IT","IT_TT","IT_TT","TW006773001B",860842,"IT"]
["TW007244001B","克拉企業","19880929","69670861","桃竹營銷處","桃竹營銷處","桃竹","DEALER_TT","DLC_TT","TW007244001B",138446,"桃竹營銷處"]
["TW006812002B","國際極品","19600304","28572330","台中營銷處","台中營銷處","台中","DEALER_TT","DLC_TT","TW006812002B",603488,"台中營銷處"]
["TW007053002B","尚合雅有限公司","19741112","59289719","SAC Sales","SAC Sales","SAC Sales","B2B_TT","CAC_TT","TW007053002B",null,"SAC sales Team"]
["TW002950002B","廣昌電器行","TW002950","97885688","SAC Sales","SAC Sales","SAC Sales","B2B_TT","CAC_TT","TW002950002B",null,"SAC sales Team"]
["TW007243001B","銘晨企業社","19831222","87262769","B2B2C","B2B2C","B2B2C","B2B_TT","B2B_TT","TW007243001B",76387,"B2B2C(B2B2C Part)"]
["TW007245001B","順輝電器行","19910528","40932325","高屏營銷處","高屏營銷處","高屏","DEALER_TT","DLC_TT","TW007245001B",11225,"高屏營銷處"]
["TW007240001B","健元電器","19601017","27691415","高屏營銷處","高屏營銷處","高屏","DEALER_TT","DLC_TT","TW007240001B",0,"高屏營銷處"]
["TW007236001B","山本耀建設","19760605","85108663","桃竹營銷處","桃竹營銷處","桃竹","DEALER_TT","DLC_TT","TW007236001B",0,"桃竹營銷處"]
["TW007214001B","鼎晶電器行","19841016","39784705","台中營銷處","台中營銷處","台中","DEALER_TT","DLC_TT","TW007214001B",70512,"台中營銷處"]
["TW002725003B","侑興電器",null,null,"SAC Sales","SAC Sales","SAC Sales","B2B_TT","CAC_TT","TW002725003B",null,"SAC sales Team"]
["TW002143002B","全省電器",null,null,"SAC Sales","SAC Sales","SAC Sales","B2B_TT","CAC_TT","TW002143002B",null,"SAC sales Team"]
["TW007249001B","沐爾有限公司","19860814","55925694","桃竹營銷處","桃竹營銷處","桃竹","DEALER_TT","DLC_TT","TW007249001B",0,"桃竹營銷處"]
["TW007247001B","喜事國際時尚",null,null,"HPC","ONLINE","ONLINE","INT_TT","TW007247001B","TW007247001B",74455,"ONLINE"]
["TW007252001B","兆暘網路科技",null,null,"HPC","ONLINE","ONLINE","INT_TT","TW007252001B","TW007252001B",null,"ONLINE"]
["TW007258001B","麥菲爾股份有限公司",null,null,"HPC","ONLINE","ONLINE","INT_TT","TW007258001B","TW007258001B",2928685,"ONLINE"]
["TW007253001B","大慶證券",null,null,"ID Sales","ID Sales","ID Sales",null,null,"TW007253001B",3199875,"ID Sales Team"]
["TW007251001B","廣宜電器",null,null,"台中營銷處","台中營銷處","台中","DEALER_TT","SPD_TT","TW007251001B",1075133,"台中營銷處"]
["TW007242001B","成邦電氣有限公司",null,null,"B2B2C","B2B2C","B2B2C","B2B_TT","B2B_TT","TW007242001B",273011,"B2B2C(B2B2C Part)"]
["TW007250001B","新美電器行",null,null,"嘉南營銷處","嘉南營銷處","嘉南","DEALER_TT","DLC_TT","TW007250001B",122116,"嘉南營銷處"]
["TW007256001B","龍松電器",null,null,"嘉南營銷處","嘉南營銷處","嘉南","DEALER_TT","DLC_TT","TW007256001B",229722,"嘉南營銷處"]

{"sheet":"預算表","index":1,"n_rows":8,"n_cols":10,"rows_kept":8,"cut":false,"hidden":false,"merged":[[2,1,2,4],[0,0,0,4]]}
["注意事項：所有促銷活動獎勵辦法，依LG公司公告內容執行，需達成目標或協議後，方可取得下列協議獎勵。\nLG公司同意之促銷活動皆須有[Promotion No.]，若無即為個人行為，LG公司概不予承認。"]
[]
["2021年9月","台　灣　樂　金　電　器　股　份　有　限　公　司"]
[{"$f":"確認code正確","v":{"$error":"#N/A"}},{"$f":"店CODE","v":0},null,"密　碼"]
["店Code：",null,"第一組：",null,{"$f":"確認1","v":"0"}]
["店　名：",{"$f":"確認店","v":""},"第二組：",null,{"$f":"確認2","v":"0"}]
[{"$f":"確認區","v":{"$error":"#N/A"}},{"$f":"確認BG","v":{"$error":"#N/A"}},{"$f":"確認BG1","v":{"$error":"#N/A"}},{"$f":"R好CODE1","v":{"$error":"#N/A"}},{"$f":"R好CODE2","v":{"$error":"#N/A"}},null,null,null,null,{"$f":"R好CODE3","v":""}]
["店代號","Promotion No","Promotion Name","起始日","到期日","獎勵內容","型號","AMT/%","單價/%"]

{"sheet":"BALANCE","index":2,"n_rows":8255,"n_cols":21,"rows_kept":8255,"cut":false,"hidden":true,"merged":[]}
["Bill To Customer Code","Bill To Customer Code","Promotion No","Promotion Name","Start Date","End Date","Property Type","Start Date","End Date","內容","店代號","店名","NO","AA","AMT/%","Description","Division","Model","Unit / %","QTY / Sales","Expected Cost"]
[{"$f":"IF(RIGHT(B2,1)=\"H\",LEFT(B2,11)&\"B\",B2)","v":"TW006332001B"},"TW006332001B","TT-NTSI-20210902-0001","GWB2108H006-ALL-TW006332-Exhibition-Sale target-Limited-20210906-20210929","2021-09-06","2021-09-29",{"$f":"MID(C2,4,4)","v":"NTSI"},{"$f":"IF(OR($G2=\"NTSI\",$G2=\"TTSI\"),$E2,LEFT($E2,4)&\"/\"&MID($E2,5,2)&\"/\"&RIGHT($E2,2))","v":"2021-09-06"},{"$f":"IF(OR($G2=\"NTSI\",$G2=\"TTSI\"),$F2,LEFT($F2,4)&\"/\"&MID($F2,5,2)&\"/\"&RIGHT($F2,2))","v":"2021-09-29"},"公司-家電-萊旺特賣會個展(切結未稅250萬,達8成給予獎勵,上限未稅6.25萬)-0906~0929","TW006332001B","萊旺電器行","TW",null,"%","萊旺特賣會個展(切結未稅250萬,達8成給予獎勵,上限未稅6.25萬)",null,"全產品",null,0]
[{"$f":"IF(RIGHT(B3,1)=\"H\",LEFT(B3,11)&\"B\",B3)","v":"TW002718001B"},"TW002718001B","TT-NTSI-20210901-0001","MMCSN2109B082-DLT-TW002718-OutdoorBillboard-Cingpu-202109","2021-09-03","2021-09-30",{"$f":"MID(C3,4,4)","v":"NTSI"},"2021-09-03","2021-09-30","公司-清淨機除濕機-戶外招牌製作贊助(青埔領航DC)-09~09","TW002718001B","全國電子","TW",null,"AMT","戶外招牌製作贊助(青埔領航DC)",null,"HADHDHDJ",10000,null,10000]
[{"$f":"IF(RIGHT(B4,1)=\"H\",LEFT(B4,11)&\"B\",B4)","v":"TW002718001B"},"TW002718001B","TT-NTSI-20210901-0001","MMCSN2109B082-DLT-TW002718-OutdoorBillboard-Cingpu-202109","2021-09-03","2021-09-30",{"$f":"MID(C4,4,4)","v":"NTSI"},"2021-09-03","2021-09-30","公司-清淨機除濕機-戶外招牌製作贊助(青埔領航DC)-09~09","TW002718001B","全國電子","TW",null,"AMT","戶外招牌製作贊助(青埔領航DC)",null,"HCWCASAC",10000,null,10000]
[{"$f":"IF(RIGHT(B5,1)=\"H\",LEFT(B5,11)&\"B\",B5)","v":"TW002718001B"},"TW002718001B","TT-NTSI-20210901-0002","MMCSN2109B082-VCC-TW002718-OutdoorBillboard-Cingpu-202109","2021-09-03","2021-09-30",{"$f":"MID(C5,4,4)","v":"NTSI"},"2021-09-03","2021-09-30","公司-吸塵器-戶外招牌製作贊助(青埔領航DC)-09~09","TW002718001B","全國電子","TW",null,"AMT","戶外招牌製作贊助(青埔領航DC)",null,"吸塵器",60000,null,60000]
[{"$f":"IF(RIGHT(B6,1)=\"H\",LEFT(B6,11)&\"B\",B6)","v":"DEALER_DEPT"},"DEALER_DEPT","TT-NTSO-20210917-0001","HPC2109D007-TV-Dept-SOA-20210921~0930",20210921,20210930,{"$f":"MID(C6,4,4)","v":"NTSO"},"2021/09/21","2021/09/30","公司-電視-實銷補助-0921~0930","DEALER_DEPT","Dealer_Dept",null,null,"AMT","實銷補助",null,"OLED77CXPWA.ATT",50000,6,300000]
[{"$f":"IF(RIGHT(B7,1)=\"H\",LEFT(B7,11)&\"B\",B7)","v":"DEALER_DEPT"},"DEALER_DEPT","TT-NTSO-20210917-0001","HPC2109D007-TV-Dept-SOA-20210921~0930",20210921,20210930,{"$f":"MID(C7,4,4)","v":"NTSO"},"2021/09/21","2021/09/30","公司-電視-實銷補助-0921~0930","DEALER_DEPT","Dealer_Dept",null,null,"AMT","實銷補助",null,"OLED77CXPWA.ATT",40000,4,160000]
["MMCS_RT","MMCS_RT","TT-NTSO-20210922-0001","MMCSN2109J028-VCC-RT-SOA-20210924~0930",20210924,20210930,"NTSO","2021/09/24","2021/09/30","公司-吸塵器-短期實銷加碼-0924~0930","MMCS_RT","MMCS_RT",null,null,"AMT","短期實銷加碼",null,"A9PSMOP2X.AIGBLTT",1980,10,19800]
["MMCS_RT","MMCS_RT","TT-NTSO-20210922-0001","MMCSN2109J028-VCC-RT-SOA-20210924~0930",20210924,20210930,"NTSO","2021/09/24","2021/09/30","公司-吸塵器-短期實銷加碼-0924~0930","MMCS_RT","MMCS_RT",null,null,"AMT","短期實銷加碼",null,"A9P-CORE.BFSBLTT",1638,15,24570]
["MMCS_RT","MMCS_RT","TT-NTSO-20210922-0001","MMCSN2109J028-VCC-RT-SOA-20210924~0930",20210924,20210930,"NTSO","2021/09/24","2021/09/30","公司-吸塵器-短期實銷加碼-0924~0930","MMCS_RT","MMCS_RT",null,null,"AMT","短期實銷加碼",null,"V-DDMOPNZ.AKVNLTT",3429,15,51435]
["TW002456001B","TW002456001B","TT-NTSO-20210906-0001","MMCSN2109A035-VCC-TW002456-SOA-202109",20210909,20210930,"NTSO","2021/09/09","2021/09/30","公司-吸塵器-實銷補助-09.09~09.30","TW002456001B","燦坤",null,null,"AMT","實銷補助",null,"A9P-CORE.BFSBLTT",800,50,40000]
["TW002456001B","TW002456001B","TT-NTSO-20210906-0001","MMCSN2109A035-VCC-TW002456-SOA-202109",20210909,20210930,"NTSO","2021/09/09","2021/09/30","公司-吸塵器-實銷補助-09.09~09.30","TW002456001B","燦坤",null,null,"AMT","實銷補助",null,"M9MAX.AFSBLTT",1600,50,80000]
["TW002456001B","TW002456001B","TT-NTSO-20210909-0001","MMCSN2109A014-TV-TW002456-EOL(8NO)-202109",20210911,20210930,"NTSO","2021/09/11","2021/09/30","公司-電視-出清補助(8貨號)-09.11~09.30","TW002456001B","燦坤",null,null,"AMT","出清補助(8貨號)",null,"OLED65CXPWA.ATT",8381,12,100572]
["TW002456001B","TW002456001B","TT-NTSO-20210909-0001","MMCSN2109A014-TV-TW002456-EOL(8NO)-202109",20210911,20210930,"NTSO","2021/09/11","2021/09/30","公司-電視-出清補助(8貨號)-09.11~09.30","TW002456001B","燦坤",null,null,"AMT","出清補助(8貨號)",null,"OLED65GXPWA.ATT",8381,12,100572]
["TW002456001B","TW002456001B","TT-NTSO-20210914-0001","MMCSN2109A016-TV-TW002456-Gift-202109",20210915,20210930,"NTSO","2021/09/15","2021/09/30","公司-電視-實銷贈品-09.15~09.30","TW002456001B","燦坤",null,null,"AMT","實銷贈品",null,"55NANO76SPA.ATT",1000,100,100000]
["TW002456001B","TW002456001B","TT-NTSO-20210914-0001","MMCSN2109A016-TV-TW002456-Gift-202109",20210915,20210930,"NTSO","2021/09/15","2021/09/30","公司-電視-實銷贈品-09.15~09.30","TW002456001B","燦坤",null,null,"AMT","實銷贈品",null,"55NANO86SPA.ATT",1000,50,50000]
["TW002456001B","TW002456001B","TT-NTSO-20210914-0001","MMCSN2109A016-TV-TW002456-Gift-202109",20210915,20210930,"NTSO","2021/09/15","2021/09/30","公司-電視-實銷贈品-09.15~09.30","TW002456001B","燦坤",null,null,"AMT","實銷贈品",null,"65NANO86SPA.ATT",3000,50,150000]
["TW002811001B","TW002811001B","TT-NTSO-20210906-0004","HETV20210906-TV-TW002811-RoadshowSOA-20210911~0920",20210911,20210920,"NTSO","2021/09/11","2021/09/20","公司-電視-9/11~9/12 Roadshow實銷-0911~0920","TW002811001B","棋杰電器",null,null,"AMT","9/11~9/12 Roadshow實銷",null,"OLED65G1PSA.ATT",5000,1,5000]
["TW002811001B","TW002811001B","TT-NTSO-20210906-0004","HETV20210906-TV-TW002811-RoadshowSOA-20210911~0920",20210911,20210920,"NTSO","2021/09/11","2021/09/20","公司-電視-9/11~9/12 Roadshow實銷-0911~0920","TW002811001B","棋杰電器",null,null,"AMT","9/11~9/12 Roadshow實銷",null,"OLED55G1PSA.ATT",3000,1,3000]
["TW002811001B","TW002811001B","TT-NTSO-20210906-0004","HETV20210906-TV-TW002811-RoadshowSOA-20210911~0920",20210911,20210920,"NTSO","2021/09/11","2021/09/20","公司-電視-9/11~9/12 Roadshow實銷-0911~0920","TW002811001B","棋杰電器",null,null,"AMT","9/11~9/12 Roadshow實銷",null,"OLED65C1PSB.ATT",5000,1,5000]
["TW002811001B","TW002811001B","TT-NTSO-20210906-0004","HETV20210906-TV-TW002811-RoadshowSOA-20210911~0920",20210911,20210920,"NTSO","2021/09/11","2021/09/20","公司-電視-9/11~9/12 Roadshow實銷-0911~0920","TW002811001B","棋杰電器",null,null,"AMT","9/11~9/12 Roadshow實銷",null,"OLED55C1PSB.ATT",3000,1,3000]
["TW003040001B","TW003040001B","TT-NTSO-20210908-0001","TPB2109A004-STYLER-TW003040-SOA-20210915~0930",20210915,20210930,"NTSO","2021/09/15","2021/09/30","公司-電子衣櫥-實銷補助-0915~0930","TW003040001B","悅鼎電器",null,null,"AMT","實銷補助",null,"E523FR.ALBBTST",3000,3,9000]
["TW003040001B","TW003040001B","TT-NTSO-20210908-0001","TPB2109A004-STYLER-TW003040-SOA-20210915~0930",20210915,20210930,"NTSO","2021/09/15","2021/09/30","公司-電子衣櫥-實銷補助-0915~0930","TW003040001B","悅鼎電器",null,null,"AMT","實銷補助",null,"E523MR.ALBBTST",3000,3,9000]
["TW003040001B","TW003040001B","TT-NTSO-20210908-0001","TPB2109A004-STYLER-TW003040-SOA-20210915~0930",20210915,20210930,"NTSO","2021/09/15","2021/09/30","公司-電子衣櫥-實銷補助-0915~0930","TW003040001B","悅鼎電器",null,null,"AMT","實銷補助",null,"E523IR.ABWBTST",3000,3,9000]
["TW003040001B","TW003040001B","TT-NTSO-20210908-0001","TPB2109A004-STYLER-TW003040-SOA-20210915~0930",20210915,20210930,"NTSO","2021/09/15","2021/09/30","公司-電子衣櫥-實銷補助-0915~0930","TW003040001B","悅鼎電器",null,null,"AMT","實銷補助",null,"B723MR.ALMBTST",3000,3,9000]
["TW003310001B","TW003310001B","TT-NTSO-20210903-0002","DWB2109F008-TV-DWB-RoadshowSOA-0907~0930",20210907,20210930,"NTSO","2021/09/07","2021/09/30","公司-電視-桃園八德廣豐合展實銷補助-0907~0931","TW003310001B","陽曜企業",null,null,"AMT","桃園八德廣豐合展實銷補助",null,"OLED65G1PSA.ATT",4761,2,9522]
["TW003310001B","TW003310001B","TT-NTSO-20210903-0002","DWB2109F008-TV-DWB-RoadshowSOA-0907~0930",20210907,20210930,"NTSO","2021/09/07","2021/09/30","公司-電視-桃園八德廣豐合展實銷補助-0907~0931","TW003310001B","陽曜企業",null,null,"AMT","桃園八德廣豐合展實銷補助",null,"OLED55G1PSA.ATT",2857,2,5714]
["TW003310001B","TW003310001B","TT-NTSO-20210903-0002","DWB2109F008-TV-DWB-RoadshowSOA-0907~0930",20210907,20210930,"NTSO","2021/09/07","2021/09/30","公司-電視-桃園八德廣豐合展實銷補助-0907~0931","TW003310001B","陽曜企業",null,null,"AMT","桃園八德廣豐合展實銷補助",null,"OLED65C1PSB.ATT",4761,2,9522]
["TW003310001B","TW003310001B","TT-NTSO-20210903-0002","DWB2109F008-TV-DWB-RoadshowSOA-0907~0930",20210907,20210930,"NTSO","2021/09/07","2021/09/30","公司-電視-桃園八德廣豐合展實銷補助-0907~0931","TW003310001B","陽曜企業",null,null,"AMT","桃園八德廣豐合展實銷補助",null,"OLED55C1PSB.ATT",2857,2,5714]
["TW003310001B","TW003310001B","TT-NTSO-20210903-0002","DWB2109F008-TV-DWB-RoadshowSOA-0907~0930",20210907,20210930,"NTSO","2021/09/07","2021/09/30","公司-電視-桃園八德廣豐合展實銷補助-0907~0931","TW003310001B","陽曜企業",null,null,"AMT","桃園八德廣豐合展實銷補助",null,"86NANO91SPA.ATT",4761,2,9522]
["TW003310001B","TW003310001B","TT-NTSO-20210903-0002","DWB2109F008-TV-DWB-RoadshowSOA-0907~0930",20210907,20210930,"NTSO","2021/09/07","2021/09/30","公司-電視-桃園八德廣豐合展實銷補助-0907~0931","TW003310001B","陽曜企業",null,null,"AMT","桃園八德廣豐合展實銷補助",null,"75NANO91SPA.ATT",2857,2,5714]
["TW003898001B","TW003898001B","TT-NTSO-20210906-0008","DNB2109K003-TV-TW003898-SOA-202109",20210907,20210929,"NTSO","2021/09/07","2021/09/29","公司-電視-實銷補助(個展)-09.07~09.29","TW003898001B","科昌電器",null,null,"AMT","實銷補助(個展)",null,"OLED65G1PSA.ATT",4762,1,4762]
["TW003898001B","TW003898001B","TT-NTSO-20210906-0008","DNB2109K003-TV-TW003898-SOA-202109",20210907,20210929,"NTSO","2021/09/07","2021/09/29","公司-電視-實銷補助(個展)-09.07~09.29","TW003898001B","科昌電器",null,null,"AMT","實銷補助(個展)",null,"OLED55G1PSA.ATT",2857,1,2857]
["TW003898001B","TW003898001B","TT-NTSO-20210906-0008","DNB2109K003-TV-TW003898-SOA-202109",20210907,20210929,"NTSO","2021/09/07","2021/09/29","公司-電視-實銷補助(個展)-09.07~09.29","TW003898001B","科昌電器",null,null,"AMT","實銷補助(個展)",null,"OLED65C1PSB.ATT",4762,3,14286]
["TW003898001B","TW003898001B","TT-NTSO-20210906-0008","DNB2109K003-TV-TW003898-SOA-202109",20210907,20210929,"NTSO","2021/09/07","2021/09/29","公司-電視-實銷補助(個展)-09.07~09.29","TW003898001B","科昌電器",null,null,"AMT","實銷補助(個展)",null,"OLED55C1PSB.ATT",2857,3,8571]
["TW004349001B","TW004349001B","TT-NTSO-20210915-0002","HETV20210913-TV-TW004349-RoadshowSOA-20210917~0924",20210917,20210924,"NTSO","2021/09/17","2021/09/24","公司-電視-9/17~9/18 Roadshow實銷-0917~0924","TW004349001B","瑨耀企業",null,null,"AMT","9/17~9/18 Roadshow實銷",null,"OLED65G1PSA.ATT",5000,1,5000]
["TW004349001B","TW004349001B","TT-NTSO-20210915-0002","HETV20210913-TV-TW004349-RoadshowSOA-20210917~0924",20210917,20210924,"NTSO","2021/09/17","2021/09/24","公司-電視-9/17~9/18 Roadshow實銷-0917~0924","TW004349001B","瑨耀企業",null,null,"AMT","9/17~9/18 Roadshow實銷",null,"OLED55G1PSA.ATT",3000,1,3000]
["TW004349001B","TW004349001B","TT-NTSO-20210915-0002","HETV20210913-TV-TW004349-RoadshowSOA-20210917~0924",20210917,20210924,"NTSO","2021/09/17","2021/09/24","公司-電視-9/17~9/18 Roadshow實銷-0917~0924","TW004349001B","瑨耀企業",null,null,"AMT","9/17~9/18 Roadshow實銷",null,"OLED65C1PSB.ATT",5000,1,5000]
["TW004349001B","TW004349001B","TT-NTSO-20210915-0002","HETV20210913-TV-TW004349-RoadshowSOA-20210917~0924",20210917,20210924,"NTSO","2021/09/17","2021/09/24","公司-電視-9/17~9/18 Roadshow實銷-0917~0924","TW004349001B","瑨耀企業",null,null,"AMT","9/17~9/18 Roadshow實銷",null,"OLED55C1PSB.ATT",3000,1,3000]
["TW004399001B","TW004399001B","TT-NTSO-20210901-0002","HETV20210830-TV-TW004399-RoadshowSOA-20210904~0913",20210904,20210913,"NTSO","2021/09/04","2021/09/13","公司-電視-9/4~9/6 Roadshow實銷-0904~0913","TW004399001B","祥建科技",null,null,"AMT","9/4~9/6 Roadshow實銷",null,"OLED65G1PSA.ATT",5000,1,5000]
["TW004399001B","TW004399001B","TT-NTSO-20210901-0002","HETV20210830-TV-TW004399-RoadshowSOA-20210904~0913",20210904,20210913,"NTSO","2021/09/04","2021/09/13","公司-電視-9/4~9/6 Roadshow實銷-0904~0913","TW004399001B","祥建科技",null,null,"AMT","9/4~9/6 Roadshow實銷",null,"OLED55G1PSA.ATT",3000,1,3000]
["TW004399001B","TW004399001B","TT-NTSO-20210901-0002","HETV20210830-TV-TW004399-RoadshowSOA-20210904~0913",20210904,20210913,"NTSO","2021/09/04","2021/09/13","公司-電視-9/4~9/6 Roadshow實銷-0904~0913","TW004399001B","祥建科技",null,null,"AMT","9/4~9/6 Roadshow實銷",null,"OLED65C1PSB.ATT",5000,1,5000]
["TW004399001B","TW004399001B","TT-NTSO-20210901-0002","HETV20210830-TV-TW004399-RoadshowSOA-20210904~0913",20210904,20210913,"NTSO","2021/09/04","2021/09/13","公司-電視-9/4~9/6 Roadshow實銷-0904~0913","TW004399001B","祥建科技",null,null,"AMT","9/4~9/6 Roadshow實銷",null,"OLED55C1PSB.ATT",3000,1,3000]
["TW004399001B","TW004399001B","TT-NTSO-20210906-0005","HETV20210906-TV-TW004399-RoadshowSOA-20210911~0920",20210911,20210920,"NTSO","2021/09/11","2021/09/20","公司-電視-9/11~9/12 Roadshow實銷-0911~0920","TW004399001B","祥建科技",null,null,"AMT","9/11~9/12 Roadshow實銷",null,"OLED65G1PSA.ATT",5000,1,5000]
["TW004399001B","TW004399001B","TT-NTSO-20210906-0005","HETV20210906-TV-TW004399-RoadshowSOA-20210911~0920",20210911,20210920,"NTSO","2021/09/11","2021/09/20","公司-電視-9/11~9/12 Roadshow實銷-0911~0920","TW004399001B","祥建科技",null,null,"AMT","9/11~9/12 Roadshow實銷",null,"OLED55G1PSA.ATT",3000,1,3000]
["TW004399001B","TW004399001B","TT-NTSO-20210906-0005","HETV20210906-TV-TW004399-RoadshowSOA-20210911~0920",20210911,20210920,"NTSO","2021/09/11","2021/09/20","公司-電視-9/11~9/12 Roadshow實銷-0911~0920","TW004399001B","祥建科技",null,null,"AMT","9/11~9/12 Roadshow實銷",null,"OLED65C1PSB.ATT",5000,1,5000]
["TW004399001B","TW004399001B","TT-NTSO-20210906-0005","HETV20210906-TV-TW004399-RoadshowSOA-20210911~0920",20210911,20210920,"NTSO","2021/09/11","2021/09/20","公司-電視-9/11~9/12 Roadshow實銷-0911~0920","TW004399001B","祥建科技",null,null,"AMT","9/11~9/12 Roadshow實銷",null,"OLED55C1PSB.ATT",3000,1,3000]
["TW004700001B","TW004700001B","TT-NTSO-20210903-0002","DWB2109F008-TV-DWB-RoadshowSOA-0907~0930",20210907,20210930,"NTSO","2021/09/07","2021/09/30","公司-電視-桃園八德廣豐合展實銷補助-0907~0931","TW004700001B","鐠羅影音",null,null,"AMT","桃園八德廣豐合展實銷補助",null,"OLED65G1PSA.ATT",4761,2,9522]
["TW004700001B","TW004700001B","TT-NTSO-20210903-0002","DWB2109F008-TV-DWB-RoadshowSOA-0907~0930",20210907,20210930,"NTSO","2021/09/07","2021/09/30","公司-電視-桃園八德廣豐合展實銷補助-0907~0931","TW004700001B","鐠羅影音",null,null,"AMT","桃園八德廣豐合展實銷補助",null,"OLED55G1PSA.ATT",2857,2,5714]
["TW004700001B","TW004700001B","TT-NTSO-20210903-0002","DWB2109F008-TV-DWB-RoadshowSOA-0907~0930",20210907,20210930,"NTSO","2021/09/07","2021/09/30","公司-電視-桃園八德廣豐合展實銷補助-0907~0931","TW004700001B","鐠羅影音",null,null,"AMT","桃園八德廣豐合展實銷補助",null,"OLED65C1PSB.ATT",4761,2,9522]
["TW004700001B","TW004700001B","TT-NTSO-20210903-0002","DWB2109F008-TV-DWB-RoadshowSOA-0907~0930",20210907,20210930,"NTSO","2021/09/07","2021/09/30","公司-電視-桃園八德廣豐合展實銷補助-0907~0931","TW004700001B","鐠羅影音",null,null,"AMT","桃園八德廣豐合展實銷補助",null,"OLED55C1PSB.ATT",2857,2,5714]
["TW004700001B","TW004700001B","TT-NTSO-20210903-0002","DWB2109F008-TV-DWB-RoadshowSOA-0907~0930",20210907,20210930,"NTSO","2021/09/07","2021/09/30","公司-電視-桃園八德廣豐合展實銷補助-0907~0931","TW004700001B","鐠羅影音",null,null,"AMT","桃園八德廣豐合展實銷補助",null,"86NANO91SPA.ATT",4761,2,9522]
["TW004700001B","TW004700001B","TT-NTSO-20210903-0002","DWB2109F008-TV-DWB-RoadshowSOA-0907~0930",20210907,20210930,"NTSO","2021/09/07","2021/09/30","公司-電視-桃園八德廣豐合展實銷補助-0907~0931","TW004700001B","鐠羅影音",null,null,"AMT","桃園八德廣豐合展實銷補助",null,"75NANO91SPA.ATT",2857,2,5714]
["TW004724001B","TW004724001B","TT-NTSO-20210903-0002","DWB2109F008-TV-DWB-RoadshowSOA-0907~0930",20210907,20210930,"NTSO","2021/09/07","2021/09/30","公司-電視-桃園八德廣豐合展實銷補助-0907~0931","TW004724001B","新視紀科技",null,null,"AMT","桃園八德廣豐合展實銷補助",null,"OLED65G1PSA.ATT",4761,2,9522]
["TW004724001B","TW004724001B","TT-NTSO-20210903-0002","DWB2109F008-TV-DWB-RoadshowSOA-0907~0930",20210907,20210930,"NTSO","2021/09/07","2021/09/30","公司-電視-桃園八德廣豐合展實銷補助-0907~0931","TW004724001B","新視紀科技",null,null,"AMT","桃園八德廣豐合展實銷補助",null,"OLED55G1PSA.ATT",2857,2,5714]
["TW004724001B","TW004724001B","TT-NTSO-20210903-0002","DWB2109F008-TV-DWB-RoadshowSOA-0907~0930",20210907,20210930,"NTSO","2021/09/07","2021/09/30","公司-電視-桃園八德廣豐合展實銷補助-0907~0931","TW004724001B","新視紀科技",null,null,"AMT","桃園八德廣豐合展實銷補助",null,"OLED65C1PSB.ATT",4761,2,9522]
["TW004724001B","TW004724001B","TT-NTSO-20210903-0002","DWB2109F008-TV-DWB-RoadshowSOA-0907~0930",20210907,20210930,"NTSO","2021/09/07","2021/09/30","公司-電視-桃園八德廣豐合展實銷補助-0907~0931","TW004724001B","新視紀科技",null,null,"AMT","桃園八德廣豐合展實銷補助",null,"OLED55C1PSB.ATT",2857,2,5714]
["TW004724001B","TW004724001B","TT-NTSO-20210903-0002","DWB2109F008-TV-DWB-RoadshowSOA-0907~0930",20210907,20210930,"NTSO","2021/09/07","2021/09/30","公司-電視-桃園八德廣豐合展實銷補助-0907~0931","TW004724001B","新視紀科技",null,null,"AMT","桃園八德廣豐合展實銷補助",null,"86NANO91SPA.ATT",4761,2,9522]
["TW004724001B","TW004724001B","TT-NTSO-20210903-0002","DWB2109F008-TV-DWB-RoadshowSOA-0907~0930",20210907,20210930,"NTSO","2021/09/07","2021/09/30","公司-電視-桃園八德廣豐合展實銷補助-0907~0931","TW004724001B","新視紀科技",null,null,"AMT","桃園八德廣豐合展實銷補助",null,"75NANO91SPA.ATT",2857,2,5714]
["TW004758001B","TW004758001B","TT-NTSO-20210901-0003","HETV20210830-TV-TW004758-RoadshowSOA-20210904~0913",20210904,20210913,"NTSO","2021/09/04","2021/09/13","公司-電視-9/4~9/6 Roadshow實銷-0904~0913","TW004758001B","同勝電器",null,null,"AMT","9/4~9/6 Roadshow實銷",null,"OLED65G1PSA.ATT",5000,1,5000]
["TW004758001B","TW004758001B","TT-NTSO-20210901-0003","HETV20210830-TV-TW004758-RoadshowSOA-20210904~0913",20210904,20210913,"NTSO","2021/09/04","2021/09/13","公司-電視-9/4~9/6 Roadshow實銷-0904~0913","TW004758001B","同勝電器",null,null,"AMT","9/4~9/6 Roadshow實銷",null,"OLED55G1PSA.ATT",3000,1,3000]
["TW004758001B","TW004758001B","TT-NTSO-20210901-0003","HETV20210830-TV-TW004758-RoadshowSOA-20210904~0913",20210904,20210913,"NTSO","2021/09/04","2021/09/13","公司-電視-9/4~9/6 Roadshow實銷-0904~0913","TW004758001B","同勝電器",null,null,"AMT","9/4~9/6 Roadshow實銷",null,"OLED65C1PSB.ATT",5000,1,5000]
["TW004758001B","TW004758001B","TT-NTSO-20210901-0003","HETV20210830-TV-TW004758-RoadshowSOA-20210904~0913",20210904,20210913,"NTSO","2021/09/04","2021/09/13","公司-電視-9/4~9/6 Roadshow實銷-0904~0913","TW004758001B","同勝電器",null,null,"AMT","9/4~9/6 Roadshow實銷",null,"OLED55C1PSB.ATT",3000,1,3000]
["TW006857001B","TW006857001B","TT-NTSO-20210908-0002","TPB2109A004-STYLER-TW006857-SOA-20210915~0930",20210915,20210930,"NTSO",{"$f":"IF(OR($G64=\"NTSI\",$G64=\"TTSI\"),$E64,LEFT($E64,4)&\"/\"&MID($E64,5,2)&\"/\"&RIGHT($E64,2))","v":"2021/09/15"},{"$f":"IF(OR($G64=\"NTSI\",$G64=\"TTSI\"),$F64,LEFT($F64,4)&\"/\"&MID($F64,5,2)&\"/\"&RIGHT($F64,2))","v":"2021/09/30"},"公司-電子衣櫥-實銷補助-0915~0930","TW006857001B","誠鴻電器",null,null,"AMT","實銷補助",null,"E523FR.ALBBTST",3000,3,9000]
["TW006857001B","TW006857001B","TT-NTSO-20210908-0002","TPB2109A004-STYLER-TW006857-SOA-20210915~0930",20210915,20210930,"NTSO","2021/09/15","2021/09/30","公司-電子衣櫥-實銷補助-0915~0930","TW006857001B","誠鴻電器",null,null,"AMT","實銷補助",null,"E523MR.ALBBTST",3000,3,9000]
["TW006857001B","TW006857001B","TT-NTSO-20210908-0002","TPB2109A004-STYLER-TW006857-SOA-20210915~0930",20210915,20210930,"NTSO","2021/09/15","2021/09/30","公司-電子衣櫥-實銷補助-0915~0930","TW006857001B","誠鴻電器",null,null,"AMT","實銷補助",null,"E523IR.ABWBTST",3000,3,9000]
["TW006857001B","TW006857001B","TT-NTSO-20210908-0002","TPB2109A004-STYLER-TW006857-SOA-20210915~0930",20210915,20210930,"NTSO","2021/09/15","2021/09/30","公司-電子衣櫥-實銷補助-0915~0930","TW006857001B","誠鴻電器",null,null,"AMT","實銷補助",null,"B723MR.ALMBTST",3000,3,9000]
["TW006857001B","TW006857001B","TT-NTSO-20210915-0004","HETV20210913-TV-TW006857-RoadshowSOA-20210918~1001",20210918,20211001,"NTSO","2021/09/18","2021/10/01","公司-電視-9/18~9/19及9/25~9/26 Roadshow實銷-0918~1001","TW006857001B","誠鴻電器",null,null,"AMT","9/18~9/19及9/25~9/26 Roadshow實銷",null,"OLED65G1PSA.ATT",5000,2,10000]
[{"$f":"IF(RIGHT(B69,1)=\"H\",LEFT(B69,11)&\"B\",B69)","v":"TW006857001B"},"TW006857001B","TT-NTSO-20210915-0004","HETV20210913-TV-TW006857-RoadshowSOA-20210918~1001",20210918,20211001,{"$f":"MID(C69,4,4)","v":"NTSO"},"2021/09/18","2021/10/01","公司-電視-9/18~9/19及9/25~9/26 Roadshow實銷-0918~1001","TW006857001B","誠鴻電器",null,null,"AMT","9/18~9/19及9/25~9/26 Roadshow實銷",null,"OLED55G1PSA.ATT",3000,2,6000]
["TW006857001B","TW006857001B","TT-NTSO-20210915-0004","HETV20210913-TV-TW006857-RoadshowSOA-20210918~1001",20210918,20211001,"NTSO","2021/09/18","2021/10/01","公司-電視-9/18~9/19及9/25~9/26 Roadshow實銷-0918~1001","TW006857001B","誠鴻電器",null,null,"AMT","9/18~9/19及9/25~9/26 Roadshow實銷",null,"OLED65C1PSB.ATT",5000,2,10000]
["TW006857001B","TW006857001B","TT-NTSO-20210915-0004","HETV20210913-TV-TW006857-RoadshowSOA-20210918~1001",20210918,20211001,"NTSO","2021/09/18","2021/10/01","公司-電視-9/18~9/19及9/25~9/26 Roadshow實銷-0918~1001","TW006857001B","誠鴻電器",null,null,"AMT","9/18~9/19及9/25~9/26 Roadshow實銷",null,"OLED55C1PSB.ATT",3000,2,6000]
["TW006897001B","TW006897001B","TT-NTSO-20210903-0002","DWB2109F008-TV-DWB-RoadshowSOA-0907~0930",20210907,20210930,"NTSO","2021/09/07","2021/09/30","公司-電視-桃園八德廣豐合展實銷補助-0907~0931","TW006897001B","姿芳科技有限公司",null,null,"AMT","桃園八德廣豐合展實銷補助",null,"OLED65G1PSA.ATT",4761,2,9522]
["TW006897001B","TW006897001B","TT-NTSO-20210903-0002","DWB2109F008-TV-DWB-RoadshowSOA-0907~0930",20210907,20210930,"NTSO","2021/09/07","2021/09/30","公司-電視-桃園八德廣豐合展實銷補助-0907~0931","TW006897001B","姿芳科技有限公司",null,null,"AMT","桃園八德廣豐合展實銷補助",null,"OLED55G1PSA.ATT",2857,2,5714]
["TW006897001B","TW006897001B","TT-NTSO-20210903-0002","DWB2109F008-TV-DWB-RoadshowSOA-0907~0930",20210907,20210930,"NTSO","2021/09/07","2021/09/30","公司-電視-桃園八德廣豐合展實銷補助-0907~0931","TW006897001B","姿芳科技有限公司",null,null,"AMT","桃園八德廣豐合展實銷補助",null,"OLED65C1PSB.ATT",4761,2,9522]
["TW006897001B","TW006897001B","TT-NTSO-20210903-0002","DWB2109F008-TV-DWB-RoadshowSOA-0907~0930",20210907,20210930,"NTSO","2021/09/07","2021/09/30","公司-電視-桃園八德廣豐合展實銷補助-0907~0931","TW006897001B","姿芳科技有限公司",null,null,"AMT","桃園八德廣豐合展實銷補助",null,"OLED55C1PSB.ATT",2857,2,5714]
["TW006897001B","TW006897001B","TT-NTSO-20210903-0002","DWB2109F008-TV-DWB-RoadshowSOA-0907~0930",20210907,20210930,"NTSO","2021/09/07","2021/09/30","公司-電視-桃園八德廣豐合展實銷補助-0907~0931","TW006897001B","姿芳科技有限公司",null,null,"AMT","桃園八德廣豐合展實銷補助",null,"86NANO91SPA.ATT",4761,2,9522]
["TW006897001B","TW006897001B","TT-NTSO-20210903-0002","DWB2109F008-TV-DWB-RoadshowSOA-0907~0930",20210907,20210930,"NTSO","2021/09/07","2021/09/30","公司-電視-桃園八德廣豐合展實銷補助-0907~0931","TW006897001B","姿芳科技有限公司",null,null,"AMT","桃園八德廣豐合展實銷補助",null,"75NANO91SPA.ATT",2857,2,5714]
["TW007053001B","TW007053001B","TT-NTSO-20210915-0005","HETV20210913-TV-TW007053-RoadshowSOA-20210924~1001",20210924,20211001,"NTSO","2021/09/24","2021/10/01","公司-電視-9/24~9/25 Roadshow實銷-0924~1001","TW007053001B","尚合雅有限公司",null,null,"AMT","9/24~9/25 Roadshow實銷",null,"OLED65G1PSA.ATT",5000,1,5000]
["TW007053001B","TW007053001B","TT-NTSO-20210915-0005","HETV20210913-TV-TW007053-RoadshowSOA-20210924~1001",20210924,20211001,"NTSO","2021/09/24","2021/10/01","公司-電視-9/24~9/25 Roadshow實銷-0924~1001","TW007053001B","尚合雅有限公司",null,null,"AMT","9/24~9/25 Roadshow實銷",null,"OLED55G1PSA.ATT",3000,1,3000]
["TW007053001B","TW007053001B","TT-NTSO-20210915-0005","HETV20210913-TV-TW007053-RoadshowSOA-20210924~1001",20210924,20211001,"NTSO","2021/09/24","2021/10/01","公司-電視-9/24~9/25 Roadshow實銷-0924~1001","TW007053001B","尚合雅有限公司",null,null,"AMT","9/24~9/25 Roadshow實銷",null,"OLED65C1PSB.ATT",5000,1,5000]
["TW007053001B","TW007053001B","TT-NTSO-20210915-0005","HETV20210913-TV-TW007053-RoadshowSOA-20210924~1001",20210924,20211001,"NTSO","2021/09/24","2021/10/01","公司-電視-9/24~9/25 Roadshow實銷-0924~1001","TW007053001B","尚合雅有限公司",null,null,"AMT","9/24~9/25 Roadshow實銷",null,"OLED55C1PSB.ATT",3000,1,3000]
["TW007134001B","TW007134001B","TT-NTSO-20210901-0004","HETV20210830-TV-TW007134-RoadshowSOA-20210904~0913",20210904,20210913,"NTSO","2021/09/04","2021/09/13","公司-電視-9/4~9/6 Roadshow實銷-0904~0913","TW007134001B","威特家電",null,null,"AMT","9/4~9/6 Roadshow實銷",null,"OLED65G1PSA.ATT",5000,1,5000]
["TW007134001B","TW007134001B","TT-NTSO-20210901-0004","HETV20210830-TV-TW007134-RoadshowSOA-20210904~0913",20210904,20210913,"NTSO","2021/09/04","2021/09/13","公司-電視-9/4~9/6 Roadshow實銷-0904~0913","TW007134001B","威特家電",null,null,"AMT","9/4~9/6 Roadshow實銷",null,"OLED55G1PSA.ATT",3000,1,3000]
["TW007134001B","TW007134001B","TT-NTSO-20210901-0004","HETV20210830-TV-TW007134-RoadshowSOA-20210904~0913",20210904,20210913,"NTSO","2021/09/04","2021/09/13","公司-電視-9/4~9/6 Roadshow實銷-0904~0913","TW007134001B","威特家電",null,null,"AMT","9/4~9/6 Roadshow實銷",null,"OLED65C1PSB.ATT",5000,1,5000]
["TW007134001B","TW007134001B","TT-NTSO-20210901-0004","HETV20210830-TV-TW007134-RoadshowSOA-20210904~0913",20210904,20210913,"NTSO","2021/09/04","2021/09/13","公司-電視-9/4~9/6 Roadshow實銷-0904~0913","TW007134001B","威特家電",null,null,"AMT","9/4~9/6 Roadshow實銷",null,"OLED55C1PSB.ATT",3000,1,3000]
["TW007134001B","TW007134001B","TT-NTSO-20210906-0006","HETV20210906-TV-TW007134-RoadshowSOA-20210911~0920",20210911,20210920,"NTSO","2021/09/11","2021/09/20","公司-電視-9/11~9/12 Roadshow實銷-0911~0920","TW007134001B","威特家電",null,null,"AMT","9/11~9/12 Roadshow實銷",null,"OLED65G1PSA.ATT",5000,1,5000]
["TW007134001B","TW007134001B","TT-NTSO-20210906-0006","HETV20210906-TV-TW007134-RoadshowSOA-20210911~0920",20210911,20210920,"NTSO","2021/09/11","2021/09/20","公司-電視-9/11~9/12 Roadshow實銷-0911~0920","TW007134001B","威特家電",null,null,"AMT","9/11~9/12 Roadshow實銷",null,"OLED55G1PSA.ATT",3000,1,3000]
["TW007134001B","TW007134001B","TT-NTSO-20210906-0006","HETV20210906-TV-TW007134-RoadshowSOA-20210911~0920",20210911,20210920,"NTSO","2021/09/11","2021/09/20","公司-電視-9/11~9/12 Roadshow實銷-0911~0920","TW007134001B","威特家電",null,null,"AMT","9/11~9/12 Roadshow實銷",null,"OLED65C1PSB.ATT",5000,1,5000]
["TW007134001B","TW007134001B","TT-NTSO-20210906-0006","HETV20210906-TV-TW007134-RoadshowSOA-20210911~0920",20210911,20210920,"NTSO","2021/09/11","2021/09/20","公司-電視-9/11~9/12 Roadshow實銷-0911~0920","TW007134001B","威特家電",null,null,"AMT","9/11~9/12 Roadshow實銷",null,"OLED55C1PSB.ATT",3000,1,3000]
["TW007134001B","TW007134001B","TT-NTSO-20210915-0006","HETV20210913-TV-TW007134-RoadshowSOA-20210918~1001",20210918,20211001,"NTSO","2021/09/18","2021/10/01","公司-電視-9/18~9/19及9/25~9/26 Roadshow實銷-0918~1001","TW007134001B","威特家電",null,null,"AMT","9/18~9/19及9/25~9/26 Roadshow實銷",null,"OLED65G1PSA.ATT",5000,2,10000]
["TW007134001B","TW007134001B","TT-NTSO-20210915-0006","HETV20210913-TV-TW007134-RoadshowSOA-20210918~1001",20210918,20211001,"NTSO","2021/09/18","2021/10/01","公司-電視-9/18~9/19及9/25~9/26 Roadshow實銷-0918~1001","TW007134001B","威特家電",null,null,"AMT","9/18~9/19及9/25~9/26 Roadshow實銷",null,"OLED55G1PSA.ATT",3000,2,6000]
["TW007134001B","TW007134001B","TT-NTSO-20210915-0006","HETV20210913-TV-TW007134-RoadshowSOA-20210918~1001",20210918,20211001,"NTSO","2021/09/18","2021/10/01","公司-電視-9/18~9/19及9/25~9/26 Roadshow實銷-0918~1001","TW007134001B","威特家電",null,null,"AMT","9/18~9/19及9/25~9/26 Roadshow實銷",null,"OLED65C1PSB.ATT",5000,2,10000]
["TW007134001B","TW007134001B","TT-NTSO-20210915-0006","HETV20210913-TV-TW007134-RoadshowSOA-20210918~1001",20210918,20211001,"NTSO","2021/09/18","2021/10/01","公司-電視-9/18~9/19及9/25~9/26 Roadshow實銷-0918~1001","TW007134001B","威特家電",null,null,"AMT","9/18~9/19及9/25~9/26 Roadshow實銷",null,"OLED55C1PSB.ATT",3000,2,6000]
["TW002750001B","TW002750001B","TT-NTSO-20210901-0001","HETV20210830-TV-TW002750-RoadshowSOA-20210904~0913",20210904,20210913,"NTSO","2021/09/04","2021/09/13","公司-電視-9/4~9/6 Roadshow實銷-0904~0913","TW002750001B","集雅社",null,null,"AMT","9/4~9/6 Roadshow實銷",null,"OLED65G1PSA.ATT",5000,5,25000]
["TW002750001B","TW002750001B","TT-NTSO-20210901-0001","HETV20210830-TV-TW002750-RoadshowSOA-20210904~0913",20210904,20210913,"NTSO","2021/09/04","2021/09/13","公司-電視-9/4~9/6 Roadshow實銷-0904~0913","TW002750001B","集雅社",null,null,"AMT","9/4~9/6 Roadshow實銷",null,"OLED55G1PSA.ATT",3000,5,15000]
["TW002750001B","TW002750001B","TT-NTSO-20210901-0001","HETV20210830-TV-TW002750-RoadshowSOA-20210904~0913",20210904,20210913,"NTSO","2021/09/04","2021/09/13","公司-電視-9/4~9/6 Roadshow實銷-0904~0913","TW002750001B","集雅社",null,null,"AMT","9/4~9/6 Roadshow實銷",null,"OLED65C1PSB.ATT",5000,5,25000]
["TW002750001B","TW002750001B","TT-NTSO-20210901-0001","HETV20210830-TV-TW002750-RoadshowSOA-20210904~0913",20210904,20210913,"NTSO","2021/09/04","2021/09/13","公司-電視-9/4~9/6 Roadshow實銷-0904~0913","TW002750001B","集雅社",null,null,"AMT","9/4~9/6 Roadshow實銷",null,"OLED55C1PSB.ATT",3000,5,15000]
["TW002750001B","TW002750001B","TT-NTSO-20210906-0003","HETV20210906-TV-TW002750-RoadshowSOA-20210911~0920",20210911,20210920,"NTSO","2021/09/11","2021/09/20","公司-電視-9/11~9/12 Roadshow實銷-0911~0920","TW002750001B","集雅社",null,null,"AMT","9/11~9/12 Roadshow實銷",null,"OLED65G1PSA.ATT",5000,5,25000]
["TW002750001B","TW002750001B","TT-NTSO-20210906-0003","HETV20210906-TV-TW002750-RoadshowSOA-20210911~0920",20210911,20210920,"NTSO","2021/09/11","2021/09/20","公司-電視-9/11~9/12 Roadshow實銷-0911~0920","TW002750001B","集雅社",null,null,"AMT","9/11~9/12 Roadshow實銷",null,"OLED55G1PSA.ATT",3000,5,15000]
["TW002750001B","TW002750001B","TT-NTSO-20210906-0003","HETV20210906-TV-TW002750-RoadshowSOA-20210911~0920",20210911,20210920,"NTSO","2021/09/11","2021/09/20","公司-電視-9/11~9/12 Roadshow實銷-0911~0920","TW002750001B","集雅社",null,null,"AMT","9/11~9/12 Roadshow實銷",null,"OLED65C1PSB.ATT",5000,5,25000]
["TW002750001B","TW002750001B","TT-NTSO-20210906-0003","HETV20210906-TV-TW002750-RoadshowSOA-20210911~0920",20210911,20210920,"NTSO","2021/09/11","2021/09/20","公司-電視-9/11~9/12 Roadshow實銷-0911~0920","TW002750001B","集雅社",null,null,"AMT","9/11~9/12 Roadshow實銷",null,"OLED55C1PSB.ATT",3000,5,15000]
["TW002750001B","TW002750001B","TT-NTSO-20210915-0001","HETV20210913-TV-TW002750-RoadshowSOA-20210918~1001",20210918,20211001,"NTSO","2021/09/18","2021/10/01","公司-電視-9/18~9/19及9/25~9/26 Roadshow實銷-0918~1001","TW002750001B","集雅社",null,null,"AMT","9/18~9/19及9/25~9/26 Roadshow實銷",null,"OLED65G1PSA.ATT",5000,8,40000]
["TW002750001B","TW002750001B","TT-NTSO-20210915-0001","HETV20210913-TV-TW002750-RoadshowSOA-20210918~1001",20210918,20211001,"NTSO","2021/09/18","2021/10/01","公司-電視-9/18~9/19及9/25~9/26 Roadshow實銷-0918~1001","TW002750001B","集雅社",null,null,"AMT","9/18~9/19及9/25~9/26 Roadshow實銷",null,"OLED55G1PSA.ATT",3000,8,24000]
["TW002750001B","TW002750001B","TT-NTSO-20210915-0001","HETV20210913-TV-TW002750-RoadshowSOA-20210918~1001",20210918,20211001,"NTSO","2021/09/18","2021/10/01","公司-電視-9/18~9/19及9/25~9/26 Roadshow實銷-0918~1001","TW002750001B","集雅社",null,null,"AMT","9/18~9/19及9/25~9/26 Roadshow實銷",null,"OLED65C1PSB.ATT",5000,8,40000]
["TW002750001B","TW002750001B","TT-NTSO-20210915-0001","HETV20210913-TV-TW002750-RoadshowSOA-20210918~1001",20210918,20211001,"NTSO","2021/09/18","2021/10/01","公司-電視-9/18~9/19及9/25~9/26 Roadshow實銷-0918~1001","TW002750001B","集雅社",null,null,"AMT","9/18~9/19及9/25~9/26 Roadshow實銷",null,"OLED55C1PSB.ATT",3000,8,24000]
["TW005281001B","TW005281001B","TT-NTSO-20210915-0003","HETV20210913-TV-TW005281-RoadshowSOA-20210918~1001",20210918,20211001,"NTSO","2021/09/18","2021/10/01","公司-電視-9/18~9/19及9/25~9/26 Roadshow實銷-0918~1001","TW005281001B","映象國際",null,null,"AMT","9/18~9/19及9/25~9/26 Roadshow實銷",null,"OLED65G1PSA.ATT",5000,2,10000]
["TW005281001B","TW005281001B","TT-NTSO-20210915-0003","HETV20210913-TV-TW005281-RoadshowSOA-20210918~1001",20210918,20211001,"NTSO","2021/09/18","2021/10/01","公司-電視-9/18~9/19及9/25~9/26 Roadshow實銷-0918~1001","TW005281001B","映象國際",null,null,"AMT","9/18~9/19及9/25~9/26 Roadshow實銷",null,"OLED55G1PSA.ATT",3000,2,6000]
["TW005281001B","TW005281001B","TT-NTSO-20210915-0003","HETV20210913-TV-TW005281-RoadshowSOA-20210918~1001",20210918,20211001,"NTSO","2021/09/18","2021/10/01","公司-電視-9/18~9/19及9/25~9/26 Roadshow實銷-0918~1001","TW005281001B","映象國際",null,null,"AMT","9/18~9/19及9/25~9/26 Roadshow實銷",null,"OLED65C1PSB.ATT",5000,2,10000]
["TW005281001B","TW005281001B","TT-NTSO-20210915-0003","HETV20210913-TV-TW005281-RoadshowSOA-20210918~1001",20210918,20211001,"NTSO","2021/09/18","2021/10/01","公司-電視-9/18~9/19及9/25~9/26 Roadshow實銷-0918~1001","TW005281001B","映象國際",null,null,"AMT","9/18~9/19及9/25~9/26 Roadshow實銷",null,"OLED55C1PSB.ATT",3000,2,6000]
["TW007176001B","TW007176001B","TT-NTSO-20210901-0005","HETV20210830-TV-TW007176-RoadshowSOA-20210904~0913",20210904,20210913,"NTSO","2021/09/04","2021/09/13","公司-電視-9/4~9/6 Roadshow實銷-0904~0913","TW007176001B","雨林新零售",null,null,"AMT","9/4~9/6 Roadshow實銷",null,"OLED65G1PSA.ATT",5000,1,5000]
["TW007176001B","TW007176001B","TT-NTSO-20210901-0005","HETV20210830-TV-TW007176-RoadshowSOA-20210904~0913",20210904,20210913,"NTSO","2021/09/04","2021/09/13","公司-電視-9/4~9/6 Roadshow實銷-0904~0913","TW007176001B","雨林新零售",null,null,"AMT","9/4~9/6 Roadshow實銷",null,"OLED55G1PSA.ATT",3000,1,3000]
["TW007176001B","TW007176001B","TT-NTSO-20210901-0005","HETV20210830-TV-TW007176-RoadshowSOA-20210904~0913",20210904,20210913,"NTSO","2021/09/04","2021/09/13","公司-電視-9/4~9/6 Roadshow實銷-0904~0913","TW007176001B","雨林新零售",null,null,"AMT","9/4~9/6 Roadshow實銷",null,"OLED65C1PSB.ATT",5000,1,5000]
["TW007176001B","TW007176001B","TT-NTSO-20210901-0005","HETV20210830-TV-TW007176-RoadshowSOA-20210904~0913",20210904,20210913,"NTSO","2021/09/04","2021/09/13","公司-電視-9/4~9/6 Roadshow實銷-0904~0913","TW007176001B","雨林新零售",null,null,"AMT","9/4~9/6 Roadshow實銷",null,"OLED55C1PSB.ATT",3000,1,3000]
["TW007176001B","TW007176001B","TT-NTSO-20210906-0007","HETV20210906-TV-TW007176-RoadshowSOA-20210911~0920",20210911,20210920,"NTSO","2021/09/11","2021/09/20","公司-電視-9/11~9/12 Roadshow實銷-0911~0920","TW007176001B","雨林新零售",null,null,"AMT","9/11~9/12 Roadshow實銷",null,"OLED65G1PSA.ATT",5000,1,5000]
["TW007176001B","TW007176001B","TT-NTSO-20210906-0007","HETV20210906-TV-TW007176-RoadshowSOA-20210911~0920",20210911,20210920,"NTSO","2021/09/11","2021/09/20","公司-電視-9/11~9/12 Roadshow實銷-0911~0920","TW007176001B","雨林新零售",null,null,"AMT","9/11~9/12 Roadshow實銷",null,"OLED55G1PSA.ATT",3000,1,3000]
["TW007176001B","TW007176001B","TT-NTSO-20210906-0007","HETV20210906-TV-TW007176-RoadshowSOA-20210911~0920",20210911,20210920,"NTSO","2021/09/11","2021/09/20","公司-電視-9/11~9/12 Roadshow實銷-0911~0920","TW007176001B","雨林新零售",null,null,"AMT","9/11~9/12 Roadshow實銷",null,"OLED65C1PSB.ATT",5000,1,5000]
["TW007176001B","TW007176001B","TT-NTSO-20210906-0007","HETV20210906-TV-TW007176-RoadshowSOA-20210911~0920",20210911,20210920,"NTSO","2021/09/11","2021/09/20","公司-電視-9/11~9/12 Roadshow實銷-0911~0920","TW007176001B","雨林新零售",null,null,"AMT","9/11~9/12 Roadshow實銷",null,"OLED55C1PSB.ATT",3000,1,3000]
["TW007176001B","TW007176001B","TT-NTSO-20210915-0007","HETV20210913-TV-TW007176-RoadshowSOA-20210918~1001",20210918,20211001,"NTSO","2021/09/18","2021/10/01","公司-電視-9/18~9/19及9/25~9/26 Roadshow實銷-0918~1001","TW007176001B","雨林新零售",null,null,"AMT","9/18~9/19及9/25~9/26 Roadshow實銷",null,"OLED65G1PSA.ATT",5000,2,10000]
["TW007176001B","TW007176001B","TT-NTSO-20210915-0007","HETV20210913-TV-TW007176-RoadshowSOA-20210918~1001",20210918,20211001,"NTSO","2021/09/18","2021/10/01","公司-電視-9/18~9/19及9/25~9/26 Roadshow實銷-0918~1001","TW007176001B","雨林新零售",null,null,"AMT","9/18~9/19及9/25~9/26 Roadshow實銷",null,"OLED55G1PSA.ATT",3000,2,6000]
["TW007176001B","TW007176001B","TT-NTSO-20210915-0007","HETV20210913-TV-TW007176-RoadshowSOA-20210918~1001",20210918,20211001,"NTSO","2021/09/18","2021/10/01","公司-電視-9/18~9/19及9/25~9/26 Roadshow實銷-0918~1001","TW007176001B","雨林新零售",null,null,"AMT","9/18~9/19及9/25~9/26 Roadshow實銷",null,"OLED65C1PSB.ATT",5000,2,10000]
["TW007176001B","TW007176001B","TT-NTSO-20210915-0007","HETV20210913-TV-TW007176-RoadshowSOA-20210918~1001",20210918,20211001,"NTSO","2021/09/18","2021/10/01","公司-電視-9/18~9/19及9/25~9/26 Roadshow實銷-0918~1001","TW007176001B","雨林新零售",null,null,"AMT","9/18~9/19及9/25~9/26 Roadshow實銷",null,"OLED55C1PSB.ATT",3000,2,6000]
["TW007185001B","TW007185001B","TT-NTSO-20210915-0008","HETV20210913-TV-TW007185-RoadshowSOA-20210918~1001",20210918,20211001,"NTSO","2021/09/18","2021/10/01","公司-電視-9/18~9/19及9/25~9/26 Roadshow實銷-0918~1001","TW007185001B","宏星技研材料股份有限公司",null,null,"AMT","9/18~9/19及9/25~9/26 Roadshow實銷",null,"OLED65G1PSA.ATT",5000,2,10000]
["TW007185001B","TW007185001B","TT-NTSO-20210915-0008","HETV20210913-TV-TW007185-RoadshowSOA-20210918~1001",20210918,20211001,"NTSO","2021/09/18","2021/10/01","公司-電視-9/18~9/19及9/25~9/26 Roadshow實銷-0918~1001","TW007185001B","宏星技研材料股份有限公司",null,null,"AMT","9/18~9/19及9/25~9/26 Roadshow實銷",null,"OLED55G1PSA.ATT",3000,2,6000]
["TW007185001B","TW007185001B","TT-NTSO-20210915-0008","HETV20210913-TV-TW007185-RoadshowSOA-20210918~1001",20210918,20211001,"NTSO","2021/09/18","2021/10/01","公司-電視-9/18~9/19及9/25~9/26 Roadshow實銷-0918~1001","TW007185001B","宏星技研材料股份有限公司",null,null,"AMT","9/18~9/19及9/25~9/26 Roadshow實銷",null,"OLED65C1PSB.ATT",5000,2,10000]
["TW007185001B","TW007185001B","TT-NTSO-20210915-0008","HETV20210913-TV-TW007185-RoadshowSOA-20210918~1001",20210918,20211001,"NTSO","2021/09/18","2021/10/01","公司-電視-9/18~9/19及9/25~9/26 Roadshow實銷-0918~1001","TW007185001B","宏星技研材料股份有限公司",null,null,"AMT","9/18~9/19及9/25~9/26 Roadshow實銷",null,"OLED55C1PSB.ATT",3000,2,6000]
[0,null,null,null,null,null,"","//","//"]
[0,null,null,null,null,null,"","//","//"]
[0,null,null,null,null,null,"",{"$f":"IF(OR($G128=\"NTSI\",$G128=\"TTSI\"),$E128,LEFT($E128,4)&\"/\"&MID($E128,5,2)&\"/\"&RIGHT($E128,2))","v":"//"},{"$f":"IF(OR($G128=\"NTSI\",$G128=\"TTSI\"),$F128,LEFT($F128,4)&\"/\"&MID($F128,5,2)&\"/\"&RIGHT($F128,2))","v":"//"}]
[0,null,null,null,null,null,"","//","//"]
[0,null,null,null,null,null,"","//","//"]
[0,null,null,null,null,null,"","//","//"]
[0,null,null,null,null,null,"","//","//"]
[{"$f":"IF(RIGHT(B133,1)=\"H\",LEFT(B133,11)&\"B\",B133)","v":0},null,null,null,null,null,{"$f":"MID(C133,4,4)","v":""},"//","//"]
[0,null,null,null,null,null,"","//","//"]
[0,null,null,null,null,null,"","//","//"]
[0,null,null,null,null,null,"","//","//"]
[0,null,null,null,null,null,"","//","//"]
[0,null,null,null,null,null,"","//","//"]
[0,null,null,null,null,null,"","//","//"]
[0,null,null,null,null,null,"","//","//"]
[0,null,null,null,null,null,"","//","//"]
[0,null,null,null,null,null,"","//","//"]
[0,null,null,null,null,null,"","//","//"]
[0,null,null,null,null,null,"","//","//"]
[0,null,null,null,null,null,"","//","//"]
[0,null,null,null,null,null,"","//","//"]
[0,null,null,null,null,null,"","//","//"]
[0,null,null,null,null,null,"","//","//"]
[0,null,null,null,null,null,"","//","//"]
[0,null,null,null,null,null,"","//","//"]
[0,null,null,null,null,null,"","//","//"]
[0,null,null,null,null,null,"","//","//"]
[0,null,null,null,null,null,"","//","//"]
[0,null,null,null,null,null,"","//","//"]
[0,null,null,null,null,null,"","//","//"]
[0,null,null,null,null,null,"","//","//"]
[0,null,null,null,null,null,"","//","//"]
[0,null,null,null,null,null,"","//","//"]
[0,null,null,null,null,null,"","//","//"]
[0,null,null,null,null,null,"","//","//"]
[0,null,null,null,null,null,"","//","//"]
[0,null,null,null,null,null,"","//","//"]
[0,null,null,null,null,null,"","//","//"]
[0,null,null,null,null,null,"","//","//"]
[0,null,null,null,null,null,"","//","//"]
[0,null,null,null,null,null,"","//","//"]
[0,null,null,null,null,null,"","//","//"]
[0,null,null,null,null,null,"","//","//"]
[0,null,null,null,null,null,"","//","//"]
[0,null,null,null,null,null,"","//","//"]
[0,null,null,null,null,null,"","//","//"]
[0,null,null,null,null,null,"","//","//"]
[0,null,null,null,null,null,"","//","//"]
[0,null,null,null,null,null,"","//","//"]
[0,null,null,null,null,null,"","//","//"]
[0,null,null,null,null,null,"","//","//"]
[0,null,null,null,null,null,"","//","//"]
[0,null,null,null,null,null,"","//","//"]
[0,null,null,null,null,null,"","//","//"]
[0,null,null,null,null,null,"","//","//"]
[0,null,null,null,null,null,"","//","//"]
[0,null,null,null,null,null,"","//","//"]
[0,null,null,null,null,null,"","//","//"]
[0,null,null,null,null,null,"","//","//"]
[0,null,null,null,null,null,"","//","//"]
[0,null,null,null,null,null,"","//","//"]
[0,null,null,null,null,null,"","//","//"]
[0,null,null,null,null,null,"","//","//"]
[0,null,null,null,null,null,"","//","//"]
[0,null,null,null,null,null,"","//","//"]
[0,null,null,null,null,null,"","//","//"]
[0,null,null,null,null,null,"",{"$f":"IF(OR($G192=\"NTSI\",$G192=\"TTSI\"),$E192,LEFT($E192,4)&\"/\"&MID($E192,5,2)&\"/\"&RIGHT($E192,2))","v":"//"},{"$f":"IF(OR($G192=\"NTSI\",$G192=\"TTSI\"),$F192,LEFT($F192,4)&\"/\"&MID($F192,5,2)&\"/\"&RIGHT($F192,2))","v":"//"}]
[0,null,null,null,null,null,"","//","//"]
[0,null,null,null,null,null,"","//","//"]
[0,null,null,null,null,null,"","//","//"]
[0,null,null,null,null,null,"","//","//"]
[{"$f":"IF(RIGHT(B197,1)=\"H\",LEFT(B197,11)&\"B\",B197)","v":0},null,null,null,null,null,{"$f":"MID(C197,4,4)","v":""},"//","//"]
[0,null,null,null,null,null,"","//","//"]
[0,null,null,null,null,null,"","//","//"]
[0,null,null,null,null,null,"","//","//"]
[0,null,null,null,null,null,"","//","//"]
[0,null,null,null,null,null,"","//","//"]
[0,null,null,null,null,null,"","//","//"]
[0,null,null,null,null,null,"","//","//"]
[0,null,null,null,null,null,"","//","//"]
[0,null,null,null,null,null,"","//","//"]
[0,null,null,null,null,null,"","//","//"]
[0,null,null,null,null,null,"","//","//"]
[0,null,null,null,null,null,"","//","//"]
[0,null,null,null,null,null,"","//","//"]
[0,null,null,null,null,null,"","//","//"]
[0,null,null,null,null,null,"","//","//"]
[0,null,null,null,null,null,"","//","//"]
[0,null,null,null,null,null,"","//","//"]
[0,null,null,null,null,null,"","//","//"]
[0,null,null,null,null,null,"","//","//"]
[0,null,null,null,null,null,"","//","//"]
[0,null,null,null,null,null,"","//","//"]
[0,null,null,null,null,null,"","//","//"]
[0,null,null,null,null,null,"","//","//"]
[0,null,null,null,null,null,"","//","//"]
[0,null,null,null,null,null,"","//","//"]
[0,null,null,null,null,null,"","//","//"]
[0,null,null,null,null,null,"","//","//"]
[0,null,null,null,null,null,"","//","//"]
[0,null,null,null,null,null,"","//","//"]
[0,null,null,null,null,null,"","//","//"]
[0,null,null,null,null,null,"","//","//"]
[0,null,null,null,null,null,"","//","//"]
[0,null,null,null,null,null,"","//","//"]
[0,null,null,null,null,null,"","//","//"]
[0,null,null,null,null,null,"","//","//"]
[0,null,null,null,null,null,"","//","//"]
[0,null,null,null,null,null,"","//","//"]
[0,null,null,null,null,null,"","//","//"]
[0,null,null,null,null,null,"","//","//"]
[0,null,null,null,null,null,"","//","//"]
[0,null,null,null,null,null,"","//","//"]
[0,null,null,null,null,null,"","//","//"]
[0,null,null,null,null,null,"","//","//"]
[0,null,null,null,null,null,"","//","//"]
[0,null,null,null,null,null,"","//","//"]
[0,null,null,null,null,null,"","//","//"]
[0,null,null,null,null,null,"","//","//"]
[0,null,null,null,null,null,"","//","//"]
[0,null,null,null,null,null,"","//","//"]
[0,null,null,null,null,null,"","//","//"]
[0,null,null,null,null,null,"","//","//"]
[0,null,null,null,null,null,"","//","//"]
[0,null,null,null,null,null,"","//","//"]
[0,null,null,null,null,null,"","//","//"]
[0,null,null,null,null,null,"","//","//"]
[0,null,null,null,null,null,"","//","//"]
[0,null,null,null,null,null,"","//","//"]
[0,null,null,null,null,null,"","//","//"]
[0,null,null,null,null,null,"",{"$f":"IF(OR($G256=\"NTSI\",$G256=\"TTSI\"),$E256,LEFT($E256,4)&\"/\"&MID($E256,5,2)&\"/\"&RIGHT($E256,2))","v":"//"},{"$f":"IF(OR($G256=\"NTSI\",$G256=\"TTSI\"),$F256,LEFT($F256,4)&\"/\"&MID($F256,5,2)&\"/\"&RIGHT($F256,2))","v":"//"}]
[0,null,null,null,null,null,"","//","//"]
[0,null,null,null,null,null,"","//","//"]
[0,null,null,null,null,null,"","//","//"]
[0,null,null,null,null,null,"","//","//"]
[{"$f":"IF(RIGHT(B261,1)=\"H\",LEFT(B261,11)&\"B\",B261)","v":0},null,null,null,null,null,{"$f":"MID(C261,4,4)","v":""},"//","//"]
[0,null,null,null,null,null,"","//","//"]
[0,null,null,null,null,null,"","//","//"]
[0,null,null,null,null,null,"","//","//"]
[0,null,null,null,null,null,"","//","//"]
[0,null,null,null,null,null,"","//","//"]
[0,null,null,null,null,null,"","//","//"]
[0,null,null,null,null,null,"","//","//"]
[0,null,null,null,null,null,"","//","//"]
[0,null,null,null,null,null,"","//","//"]
[0,null,null,null,null,null,"","//","//"]
[0,null,null,null,null,null,"","//","//"]
[0,null,null,null,null,null,"","//","//"]
[0,null,null,null,null,null,"","//","//"]
[0,null,null,null,null,null,"","//","//"]
[0,null,null,null,null,null,"","//","//"]
[0,null,null,null,null,null,"","//","//"]
[0,null,null,null,null,null,"","//","//"]
[0,null,null,null,null,null,"","//","//"]
[0,null,null,null,null,null,"","//","//"]
[0,null,null,null,null,null,"","//","//"]
[0,null,null,null,null,null,"","//","//"]
[0,null,null,null,null,null,"","//","//"]
[0,null,null,null,null,null,"","//","//"]
[0,null,null,null,null,null,"","//","//"]
[0,null,null,null,null,null,"","//","//"]
[0,null,null,null,null,null,"","//","//"]
[0,null,null,null,null,null,"","//","//"]
[0,null,null,null,null,null,"","//","//"]
[0,null,null,null,null,null,"","//","//"]
[0,null,null,null,null,null,"","//","//"]
[0,null,null,null,null,null,"","//","//"]
[0,null,null,null,null,null,"","//","//"]
[0,null,null,null,null,null,"","//","//"]
[0,null,null,null,null,null,"","//","//"]
[0,null,null,null,null,null,"","//","//"]
[0,null,null,null,null,null,"","//","//"]
[0,null,null,null,null,null,"","//","//"]
[0,null,null,null,null,null,"","//","//"]
[0,null,null,null,null,null,"","//","//"]
[0,null,null,null,null,null,"","//","//"]
[0,null,null,null,null,null,"","//","//"]
[0,null,null,null,null,null,"","//","//"]
[0,null,null,null,null,null,"","//","//"]
[0,null,null,null,null,null,"","//","//"]
[0,null,null,null,null,null,"","//","//"]
[0,null,null,null,null,null,"","//","//"]
[0,null,null,null,null,null,"","//","//"]
[0,null,null,null,null,null,"","//","//"]
[0,null,null,null,null,null,"","//","//"]
[0,null,null,null,null,null,"","//","//"]
[0,null,null,null,null,null,"","//","//"]
[0,null,null,null,null,null,"","//","//"]
[0,null,null,null,null,null,"","//","//"]
[0,null,null,null,null,null,"","//","//"]
[0,null,null,null,null,null,"","//","//"]
[0,null,null,null,null,null,"","//","//"]
[0,null,null,null,null,null,"","//","//"]
[0,null,null,null,null,null,"","//","//"]
[0,null,null,null,null,null,"",{"$f":"IF(OR($G320=\"NTSI\",$G320=\"TTSI\"),$E320,LEFT($E320,4)&\"/\"&MID($E320,5,2)&\"/\"&RIGHT($E320,2))","v":"//"},{"$f":"IF(OR($G320=\"NTSI\",$G320=\"TTSI\"),$F320,LEFT($F320,4)&\"/\"&MID($F320,5,2)&\"/\"&RIGHT($F320,2))","v":"//"}]
[0,null,null,null,null,null,"","//","//"]
[0,null,null,null,null,null,"","//","//"]
[0,null,null,null,null,null,"","//","//"]
[0,null,null,null,null,null,"","//","//"]
[{"$f":"IF(RIGHT(B325,1)=\"H\",LEFT(B325,11)&\"B\",B325)","v":0},null,null,null,null,null,{"$f":"MID(C325,4,4)","v":""},"//","//"]
[0,null,null,null,null,null,"","//","//"]
[0,null,null,null,null,null,"","//","//"]
[0,null,null,null,null,null,"","//","//"]
[0,null,null,null,null,null,"","//","//"]
[0,null,null,null,null,null,"","//","//"]
[0,null,null,null,null,null,"","//","//"]
[0,null,null,null,null,null,"","//","//"]
[0,null,null,null,null,null,"","//","//"]
[0,null,null,null,null,null,"","//","//"]
[0,null,null,null,null,null,"","//","//"]
[0,null,null,null,null,null,"","//","//"]
[0,null,null,null,null,null,"","//","//"]
[0,null,null,null,null,null,"","//","//"]
[0,null,null,null,null,null,"","//","//"]
[0,null,null,null,null,null,"","//","//"]
[0,null,null,null,null,null,"","//","//"]
[0,null,null,null,null,null,"","//","//"]
[0,null,null,null,null,null,"","//","//"]
[0,null,null,null,null,null,"","//","//"]
[0,null,null,null,null,null,"","//","//"]
[0,null,null,null,null,null,"","//","//"]
[0,null,null,null,null,null,"","//","//"]
[0,null,null,null,null,null,"","//","//"]
[0,null,null,null,null,null,"","//","//"]
[0,null,null,null,null,null,"","//","//"]
[0,null,null,null,null,null,"","//","//"]
[0,null,null,null,null,null,"","//","//"]
[0,null,null,null,null,null,"","//","//"]
[0,null,null,null,null,null,"","//","//"]
[0,null,null,null,null,null,"","//","//"]
[0,null,null,null,null,null,"","//","//"]
[0,null,null,null,null,null,"","//","//"]
[0,null,null,null,null,null,"","//","//"]
[0,null,null,null,null,null,"","//","//"]
[0,null,null,null,null,null,"","//","//"]
[0,null,null,null,null,null,"","//","//"]
[0,null,null,null,null,null,"","//","//"]
[0,null,null,null,null,null,"","//","//"]
[0,null,null,null,null,null,"","//","//"]
[0,null,null,null,null,null,"","//","//"]
[0,null,null,null,null,null,"","//","//"]
[0,null,null,null,null,null,"","//","//"]
[0,null,null,null,null,null,"","//","//"]
[0,null,null,null,null,null,"","//","//"]
[0,null,null,null,null,null,"","//","//"]
[0,null,null,null,null,null,"","//","//"]
[0,null,null,null,null,null,"","//","//"]
[0,null,null,null,null,null,"","//","//"]
[0,null,null,null,null,null,"","//","//"]
[0,null,null,null,null,null,"","//","//"]
[0,null,null,null,null,null,"","//","//"]
[0,null,null,null,null,null,"","//","//"]
[0,null,null,null,null,null,"","//","//"]
[0,null,null,null,null,null,"","//","//"]
[0,null,null,null,null,null,"","//","//"]
[0,null,null,null,null,null,"","//","//"]
[0,null,null,null,null,null,"","//","//"]
[0,null,null,null,null,null,"","//","//"]
[0,null,null,null,null,null,"",{"$f":"IF(OR($G384=\"NTSI\",$G384=\"TTSI\"),$E384,LEFT($E384,4)&\"/\"&MID($E384,5,2)&\"/\"&RIGHT($E384,2))","v":"//"},{"$f":"IF(OR($G384=\"NTSI\",$G384=\"TTSI\"),$F384,LEFT($F384,4)&\"/\"&MID($F384,5,2)&\"/\"&RIGHT($F384,2))","v":"//"}]
[0,null,null,null,null,null,"","//","//"]
[0,null,null,null,null,null,"","//","//"]
[0,null,null,null,null,null,"","//","//"]
[0,null,null,null,null,null,"","//","//"]
[{"$f":"IF(RIGHT(B389,1)=\"H\",LEFT(B389,11)&\"B\",B389)","v":0},null,null,null,null,null,{"$f":"MID(C389,4,4)","v":""},"//","//"]
[0,null,null,null,null,null,"","//","//"]
[0,null,null,null,null,null,"","//","//"]
[0,null,null,null,null,null,"","//","//"]
[0,null,null,null,null,null,"","//","//"]
[0,null,null,null,null,null,"","//","//"]
[0,null,null,null,null,null,"","//","//"]
[0,null,null,null,null,null,"","//","//"]
[0,null,null,null,null,null,"","//","//"]
[0,null,null,null,null,null,"","//","//"]
[0,null,null,null,null,null,"","//","//"]
[0,null,null,null,null,null,"","//","//"]
[0,null,null,null,null,null,"","//","//"]
[0,null,null,null,null,null,"","//","//"]
[0,null,null,null,null,null,"","//","//"]
[0,null,null,null,null,null,"","//","//"]
[0,null,null,null,null,null,"","//","//"]
[0,null,null,null,null,null,"","//","//"]
[0,null,null,null,null,null,"","//","//"]
[0,null,null,null,null,null,"","//","//"]
[0,null,null,null,null,null,"","//","//"]
[0,null,null,null,null,null,"","//","//"]
[0,null,null,null,null,null,"","//","//"]
[0,null,null,null,null,null,"","//","//"]
[0,null,null,null,null,null,"","//","//"]
[0,null,null,null,null,null,"","//","//"]
[0,null,null,null,null,null,"","//","//"]
[0,null,null,null,null,null,"","//","//"]
[0,null,null,null,null,null,"","//","//"]
[0,null,null,null,null,null,"","//","//"]
[0,null,null,null,null,null,"","//","//"]
[0,null,null,null,null,null,"","//","//"]
[0,null,null,null,null,null,"","//","//"]
[0,null,null,null,null,null,"","//","//"]
[0,null,null,null,null,null,"","//","//"]
[0,null,null,null,null,null,"","//","//"]
[0,null,null,null,null,null,"","//","//"]
[0,null,null,null,null,null,"","//","//"]
[0,null,null,null,null,null,"","//","//"]
[0,null,null,null,null,null,"","//","//"]
[0,null,null,null,null,null,"","//","//"]
[0,null,null,null,null,null,"","//","//"]
[0,null,null,null,null,null,"","//","//"]
[0,null,null,null,null,null,"","//","//"]
[0,null,null,null,null,null,"","//","//"]
[0,null,null,null,null,null,"","//","//"]
[0,null,null,null,null,null,"","//","//"]
[0,null,null,null,null,null,"","//","//"]
[0,null,null,null,null,null,"","//","//"]
[0,null,null,null,null,null,"","//","//"]
[0,null,null,null,null,null,"","//","//"]
[0,null,null,null,null,null,"","//","//"]
[0,null,null,null,null,null,"","//","//"]
[0,null,null,null,null,null,"","//","//"]
[0,null,null,null,null,null,"","//","//"]
[0,null,null,null,null,null,"","//","//"]
[0,null,null,null,null,null,"","//","//"]
[0,null,null,null,null,null,"","//","//"]
[0,null,null,null,null,null,"","//","//"]
[0,null,null,null,null,null,"",{"$f":"IF(OR($G448=\"NTSI\",$G448=\"TTSI\"),$E448,LEFT($E448,4)&\"/\"&MID($E448,5,2)&\"/\"&RIGHT($E448,2))","v":"//"},{"$f":"IF(OR($G448=\"NTSI\",$G448=\"TTSI\"),$F448,LEFT($F448,4)&\"/\"&MID($F448,5,2)&\"/\"&RIGHT($F448,2))","v":"//"}]
[0,null,null,null,null,null,"","//","//"]
[0,null,null,null,null,null,"","//","//"]
[0,null,null,null,null,null,"","//","//"]
[0,null,null,null,null,null,"","//","//"]
[{"$f":"IF(RIGHT(B453,1)=\"H\",LEFT(B453,11)&\"B\",B453)","v":0},null,null,null,null,null,{"$f":"MID(C453,4,4)","v":""},"//","//"]
[0,null,null,null,null,null,"","//","//"]
[0,null,null,null,null,null,"","//","//"]
[0,null,null,null,null,null,"","//","//"]
[0,null,null,null,null,null,"","//","//"]
[0,null,null,null,null,null,"","//","//"]
[0,null,null,null,null,null,"","//","//"]
[0,null,null,null,null,null,"","//","//"]
[0,null,null,null,null,null,"","//","//"]
[0,null,null,null,null,null,"","//","//"]
[0,null,null,null,null,null,"","//","//"]
[0,null,null,null,null,null,"","//","//"]
[0,null,null,null,null,null,"","//","//"]
[0,null,null,null,null,null,"","//","//"]
[0,null,null,null,null,null,"","//","//"]
[0,null,null,null,null,null,"","//","//"]
[0,null,null,null,null,null,"","//","//"]
[0,null,null,null,null,null,"","//","//"]
[0,null,null,null,null,null,"","//","//"]
[0,null,null,null,null,null,"","//","//"]
[0,null,null,null,null,null,"","//","//"]
[0,null,null,null,null,null,"","//","//"]
[0,null,null,null,null,null,"","//","//"]
[0,null,null,null,null,null,"","//","//"]
[0,null,null,null,null,null,"","//","//"]
[0,null,null,null,null,null,"","//","//"]
[0,null,null,null,null,null,"","//","//"]
[0,null,null,null,null,null,"","//","//"]
[0,null,null,null,null,null,"","//","//"]
[0,null,null,null,null,null,"","//","//"]
[0,null,null,null,null,null,"","//","//"]
[0,null,null,null,null,null,"","//","//"]
[0,null,null,null,null,null,"","//","//"]
[0,null,null,null,null,null,"","//","//"]
[0,null,null,null,null,null,"","//","//"]
[0,null,null,null,null,null,"","//","//"]
[0,null,null,null,null,null,"","//","//"]
[0,null,null,null,null,null,"","//","//"]
[0,null,null,null,null,null,"","//","//"]
[0,null,null,null,null,null,"","//","//"]
[0,null,null,null,null,null,"","//","//"]
[0,null,null,null,null,null,"","//","//"]
[0,null,null,null,null,null,"","//","//"]
[0,null,null,null,null,null,"","//","//"]
[0,null,null,null,null,null,"","//","//"]
[0,null,null,null,null,null,"","//","//"]
[0,null,null,null,null,null,"","//","//"]
[0,null,null,null,null,null,"","//","//"]
[0,null,null,null,null,null,"","//","//"]
[0,null,null,null,null,null,"","//","//"]
[0,null,null,null,null,null,"","//","//"]
[0,null,null,null,null,null,"","//","//"]
[0,null,null,null,null,null,"","//","//"]
[0,null,null,null,null,null,"","//","//"]
[0,null,null,null,null,null,"","//","//"]
[0,null,null,null,null,null,"","//","//"]
[0,null,null,null,null,null,"","//","//"]
[0,null,null,null,null,null,"","//","//"]
[0,null,null,null,null,null,"","//","//"]
[0,null,null,null,null,null,"",{"$f":"IF(OR($G512=\"NTSI\",$G512=\"TTSI\"),$E512,LEFT($E512,4)&\"/\"&MID($E512,5,2)&\"/\"&RIGHT($E512,2))","v":"//"},{"$f":"IF(OR($G512=\"NTSI\",$G512=\"TTSI\"),$F512,LEFT($F512,4)&\"/\"&MID($F512,5,2)&\"/\"&RIGHT($F512,2))","v":"//"}]
[0,null,null,null,null,null,"","//","//"]
[0,null,null,null,null,null,"","//","//"]
[0,null,null,null,null,null,"","//","//"]
[0,null,null,null,null,null,"","//","//"]
[{"$f":"IF(RIGHT(B517,1)=\"H\",LEFT(B517,11)&\"B\",B517)","v":0},null,null,null,null,null,{"$f":"MID(C517,4,4)","v":""},"//","//"]
[0,null,null,null,null,null,"","//","//"]
[0,null,null,null,null,null,"","//","//"]
[0,null,null,null,null,null,"","//","//"]
[0,null,null,null,null,null,"","//","//"]
[0,null,null,null,null,null,"","//","//"]
[0,null,null,null,null,null,"","//","//"]
[0,null,null,null,null,null,"","//","//"]
[0,null,null,null,null,null,"","//","//"]
[0,null,null,null,null,null,"","//","//"]
[0,null,null,null,null,null,"","//","//"]
[0,null,null,null,null,null,"","//","//"]
[0,null,null,null,null,null,"","//","//"]
[0,null,null,null,null,null,"","//","//"]
[0,null,null,null,null,null,"","//","//"]
[0,null,null,null,null,null,"","//","//"]
[0,null,null,null,null,null,"","//","//"]
[0,null,null,null,null,null,"","//","//"]
[0,null,null,null,null,null,"","//","//"]
[0,null,null,null,null,null,"","//","//"]
[0,null,null,null,null,null,"","//","//"]
[0,null,null,null,null,null,"","//","//"]
[0,null,null,null,null,null,"","//","//"]
[0,null,null,null,null,null,"","//","//"]
[0,null,null,null,null,null,"","//","//"]
[0,null,null,null,null,null,"","//","//"]
[0,null,null,null,null,null,"","//","//"]
[0,null,null,null,null,null,"","//","//"]
[0,null,null,null,null,null,"","//","//"]
[0,null,null,null,null,null,"","//","//"]
[0,null,null,null,null,null,"","//","//"]
[0,null,null,null,null,null,"","//","//"]
[0,null,null,null,null,null,"","//","//"]
[0,null,null,null,null,null,"","//","//"]
[0,null,null,null,null,null,"","//","//"]
[0,null,null,null,null,null,"","//","//"]
[0,null,null,null,null,null,"","//","//"]
[0,null,null,null,null,null,"","//","//"]
[0,null,null,null,null,null,"","//","//"]
[0,null,null,null,null,null,"","//","//"]
[0,null,null,null,null,null,"","//","//"]
[0,null,null,null,null,null,"","//","//"]
[0,null,null,null,null,null,"","//","//"]
[0,null,null,null,null,null,"","//","//"]
[0,null,null,null,null,null,"","//","//"]
[0,null,null,null,null,null,"","//","//"]
[0,null,null,null,null,null,"","//","//"]
[0,null,null,null,null,null,"","//","//"]
[0,null,null,null,null,null,"","//","//"]
[0,null,null,null,null,null,"","//","//"]
[0,null,null,null,null,null,"","//","//"]
[0,null,null,null,null,null,"","//","//"]
[0,null,null,null,null,null,"","//","//"]
[0,null,null,null,null,null,"","//","//"]
[0,null,null,null,null,null,"","//","//"]
[0,null,null,null,null,null,"","//","//"]
[0,null,null,null,null,null,"","//","//"]
[0,null,null,null,null,null,"","//","//"]
[0,null,null,null,null,null,"","//","//"]
[0,null,null,null,null,null,"",{"$f":"IF(OR($G576=\"NTSI\",$G576=\"TTSI\"),$E576,LEFT($E576,4)&\"/\"&MID($E576,5,2)&\"/\"&RIGHT($E576,2))","v":"//"},{"$f":"IF(OR($G576=\"NTSI\",$G576=\"TTSI\"),$F576,LEFT($F576,4)&\"/\"&MID($F576,5,2)&\"/\"&RIGHT($F576,2))","v":"//"}]
[0,null,null,null,null,null,"","//","//"]
[0,null,null,null,null,null,"","//","//"]
[0,null,null,null,null,null,"","//","//"]
[0,null,null,null,null,null,"","//","//"]
[{"$f":"IF(RIGHT(B581,1)=\"H\",LEFT(B581,11)&\"B\",B581)","v":0},null,null,null,null,null,{"$f":"MID(C581,4,4)","v":""},"//","//"]
[0,null,null,null,null,null,"","//","//"]
[0,null,null,null,null,null,"","//","//"]
[0,null,null,null,null,null,"","//","//"]
[0,null,null,null,null,null,"","//","//"]
[0,null,null,null,null,null,"","//","//"]
[0,null,null,null,null,null,"","//","//"]
[0,null,null,null,null,null,"","//","//"]
[0,null,null,null,null,null,"","//","//"]
[0,null,null,null,null,null,"","//","//"]
[0,null,null,null,null,null,"","//","//"]
[0,null,null,null,null,null,"","//","//"]
[0,null,null,null,null,null,"","//","//"]
[0,null,null,null,null,null,"","//","//"]
[0,null,null,null,null,null,"","//","//"]
[0,null,null,null,null,null,"","//","//"]
[0,null,null,null,null,null,"","//","//"]
[0,null,null,null,null,null,"","//","//"]
[0,null,null,null,null,null,"","//","//"]
[0,null,null,null,null,null,"","//","//"]
[0,null,null,null,null,null,"","//","//"]
[0,null,null,null,null,null,"","//","//"]
[0,null,null,null,null,null,"","//","//"]
[0,null,null,null,null,null,"","//","//"]
[0,null,null,null,null,null,"","//","//"]
[0,null,null,null,null,null,"","//","//"]
[0,null,null,null,null,null,"","//","//"]
[0,null,null,null,null,null,"","//","//"]
[0,null,null,null,null,null,"","//","//"]
[0,null,null,null,null,null,"","//","//"]
[0,null,null,null,null,null,"","//","//"]
[0,null,null,null,null,null,"","//","//"]
[0,null,null,null,null,null,"","//","//"]
[0,null,null,null,null,null,"","//","//"]
[0,null,null,null,null,null,"","//","//"]
[0,null,null,null,null,null,"","//","//"]
[0,null,null,null,null,null,"","//","//"]
[0,null,null,null,null,null,"","//","//"]
[0,null,null,null,null,null,"","//","//"]
[0,null,null,null,null,null,"","//","//"]
[0,null,null,null,null,null,"","//","//"]
[0,null,null,null,null,null,"","//","//"]
[0,null,null,null,null,null,"","//","//"]
[0,null,null,null,null,null,"","//","//"]
[0,null,null,null,null,null,"","//","//"]
[0,null,null,null,null,null,"","//","//"]
[0,null,null,null,null,null,"","//","//"]
[0,null,null,null,null,null,"","//","//"]
[0,null,null,null,null,null,"","//","//"]
[0,null,null,null,null,null,"","//","//"]
[0,null,null,null,null,null,"","//","//"]
[0,null,null,null,null,null,"","//","//"]
[0,null,null,null,null,null,"","//","//"]
[0,null,null,null,null,null,"","//","//"]
[0,null,null,null,null,null,"","//","//"]
[0,null,null,null,null,null,"","//","//"]
[0,null,null,null,null,null,"","//","//"]
[0,null,null,null,null,null,"","//","//"]
[0,null,null,null,null,null,"","//","//"]
[0,null,null,null,null,null,"",{"$f":"IF(OR($G640=\"NTSI\",$G640=\"TTSI\"),$E640,LEFT($E640,4)&\"/\"&MID($E640,5,2)&\"/\"&RIGHT($E640,2))","v":"//"},{"$f":"IF(OR($G640=\"NTSI\",$G640=\"TTSI\"),$F640,LEFT($F640,4)&\"/\"&MID($F640,5,2)&\"/\"&RIGHT($F640,2))","v":"//"}]
[0,null,null,null,null,null,"","//","//"]
[0,null,null,null,null,null,"","//","//"]
[0,null,null,null,null,null,"","//","//"]
[0,null,null,null,null,null,"","//","//"]
[{"$f":"IF(RIGHT(B645,1)=\"H\",LEFT(B645,11)&\"B\",B645)","v":0},null,null,null,null,null,{"$f":"MID(C645,4,4)","v":""},"//","//"]
[0,null,null,null,null,null,"","//","//"]
[0,null,null,null,null,null,"","//","//"]
[0,null,null,null,null,null,"","//","//"]
[0,null,null,null,null,null,"","//","//"]
[0,null,null,null,null,null,"","//","//"]
[0,null,null,null,null,null,"","//","//"]
[0,null,null,null,null,null,"","//","//"]
[0,null,null,null,null,null,"","//","//"]
[0,null,null,null,null,null,"","//","//"]
[0,null,null,null,null,null,"","//","//"]
[0,null,null,null,null,null,"","//","//"]
[0,null,null,null,null,null,"","//","//"]
[0,null,null,null,null,null,"","//","//"]
[0,null,null,null,null,null,"","//","//"]
[0,null,null,null,null,null,"","//","//"]
[0,null,null,null,null,null,"","//","//"]
[0,null,null,null,null,null,"","//","//"]
[0,null,null,null,null,null,"","//","//"]
[0,null,null,null,null,null,"","//","//"]
[0,null,null,null,null,null,"","//","//"]
[0,null,null,null,null,null,"","//","//"]
[0,null,null,null,null,null,"","//","//"]
[0,null,null,null,null,null,"","//","//"]
[0,null,null,null,null,null,"","//","//"]
[0,null,null,null,null,null,"","//","//"]
[0,null,null,null,null,null,"","//","//"]
[0,null,null,null,null,null,"","//","//"]
[0,null,null,null,null,null,"","//","//"]
[0,null,null,null,null,null,"","//","//"]
[0,null,null,null,null,null,"","//","//"]
[0,null,null,null,null,null,"","//","//"]
[0,null,null,null,null,null,"","//","//"]
[0,null,null,null,null,null,"","//","//"]
[0,null,null,null,null,null,"","//","//"]
[0,null,null,null,null,null,"","//","//"]
[0,null,null,null,null,null,"","//","//"]
[0,null,null,null,null,null,"","//","//"]
[0,null,null,null,null,null,"","//","//"]
[0,null,null,null,null,null,"","//","//"]
[0,null,null,null,null,null,"","//","//"]
[0,null,null,null,null,null,"","//","//"]
[0,null,null,null,null,null,"","//","//"]
[0,null,null,null,null,null,"","//","//"]
[0,null,null,null,null,null,"","//","//"]
[0,null,null,null,null,null,"","//","//"]
[0,null,null,null,null,null,"","//","//"]
[0,null,null,null,null,null,"","//","//"]
[0,null,null,null,null,null,"","//","//"]
[0,null,null,null,null,null,"","//","//"]
[0,null,null,null,null,null,"","//","//"]
[0,null,null,null,null,null,"","//","//"]
[0,null,null,null,null,null,"","//","//"]
[0,null,null,null,null,null,"","//","//"]
[0,null,null,null,null,null,"","//","//"]
[0,null,null,null,null,null,"","//","//"]
[0,null,null,null,null,null,"","//","//"]
[0,null,null,null,null,null,"","//","//"]
[0,null,null,null,null,null,"","//","//"]
[0,null,null,null,null,null,"",{"$f":"IF(OR($G704=\"NTSI\",$G704=\"TTSI\"),$E704,LEFT($E704,4)&\"/\"&MID($E704,5,2)&\"/\"&RIGHT($E704,2))","v":"//"},{"$f":"IF(OR($G704=\"NTSI\",$G704=\"TTSI\"),$F704,LEFT($F704,4)&\"/\"&MID($F704,5,2)&\"/\"&RIGHT($F704,2))","v":"//"}]
[0,null,null,null,null,null,"","//","//"]
[0,null,null,null,null,null,"","//","//"]
[0,null,null,null,null,null,"","//","//"]
[0,null,null,null,null,null,"","//","//"]
[{"$f":"IF(RIGHT(B709,1)=\"H\",LEFT(B709,11)&\"B\",B709)","v":0},null,null,null,null,null,{"$f":"MID(C709,4,4)","v":""},"//","//"]
[0,null,null,null,null,null,"","//","//"]
[0,null,null,null,null,null,"","//","//"]
[0,null,null,null,null,null,"","//","//"]
[0,null,null,null,null,null,"","//","//"]
[0,null,null,null,null,null,"","//","//"]
[0,null,null,null,null,null,"","//","//"]
[0,null,null,null,null,null,"","//","//"]
[0,null,null,null,null,null,"","//","//"]
[0,null,null,null,null,null,"","//","//"]
[0,null,null,null,null,null,"","//","//"]
[0,null,null,null,null,null,"","//","//"]
[0,null,null,null,null,null,"","//","//"]
[0,null,null,null,null,null,"","//","//"]
[0,null,null,null,null,null,"","//","//"]
[0,null,null,null,null,null,"","//","//"]
[0,null,null,null,null,null,"","//","//"]
[0,null,null,null,null,null,"","//","//"]
[0,null,null,null,null,null,"","//","//"]
[0,null,null,null,null,null,"","//","//"]
[0,null,null,null,null,null,"","//","//"]
[0,null,null,null,null,null,"","//","//"]
[0,null,null,null,null,null,"","//","//"]
[0,null,null,null,null,null,"","//","//"]
[0,null,null,null,null,null,"","//","//"]
[0,null,null,null,null,null,"","//","//"]
[0,null,null,null,null,null,"","//","//"]
[0,null,null,null,null,null,"","//","//"]
[0,null,null,null,null,null,"","//","//"]
[0,null,null,null,null,null,"","//","//"]
[0,null,null,null,null,null,"","//","//"]
[0,null,null,null,null,null,"","//","//"]
[0,null,null,null,null,null,"","//","//"]
[0,null,null,null,null,null,"","//","//"]
[0,null,null,null,null,null,"","//","//"]
[0,null,null,null,null,null,"","//","//"]
[0,null,null,null,null,null,"","//","//"]
[0,null,null,null,null,null,"","//","//"]
[0,null,null,null,null,null,"","//","//"]
[0,null,null,null,null,null,"","//","//"]
[0,null,null,null,null,null,"","//","//"]
[0,null,null,null,null,null,"","//","//"]
[0,null,null,null,null,null,"","//","//"]
[0,null,null,null,null,null,"","//","//"]
[0,null,null,null,null,null,"","//","//"]
[0,null,null,null,null,null,"","//","//"]
[0,null,null,null,null,null,"","//","//"]
[0,null,null,null,null,null,"","//","//"]
[0,null,null,null,null,null,"","//","//"]
[0,null,null,null,null,null,"","//","//"]
[0,null,null,null,null,null,"","//","//"]
[0,null,null,null,null,null,"","//","//"]
[0,null,null,null,null,null,"","//","//"]
[0,null,null,null,null,null,"","//","//"]
[0,null,null,null,null,null,"","//","//"]
[0,null,null,null,null,null,"","//","//"]
[0,null,null,null,null,null,"","//","//"]
[0,null,null,null,null,null,"","//","//"]
[0,null,null,null,null,null,"","//","//"]
[0,null,null,null,null,null,"",{"$f":"IF(OR($G768=\"NTSI\",$G768=\"TTSI\"),$E768,LEFT($E768,4)&\"/\"&MID($E768,5,2)&\"/\"&RIGHT($E768,2))","v":"//"},{"$f":"IF(OR($G768=\"NTSI\",$G768=\"TTSI\"),$F768,LEFT($F768,4)&\"/\"&MID($F768,5,2)&\"/\"&RIGHT($F768,2))","v":"//"}]
[0,null,null,null,null,null,"","//","//"]
[0,null,null,null,null,null,"","//","//"]
[0,null,null,null,null,null,"","//","//"]
[0,null,null,null,null,null,"","//","//"]
[{"$f":"IF(RIGHT(B773,1)=\"H\",LEFT(B773,11)&\"B\",B773)","v":0},null,null,null,null,null,{"$f":"MID(C773,4,4)","v":""},"//","//"]
[0,null,null,null,null,null,"","//","//"]
[0,null,null,null,null,null,"","//","//"]
[0,null,null,null,null,null,"","//","//"]
[0,null,null,null,null,null,"","//","//"]
[0,null,null,null,null,null,"","//","//"]
[0,null,null,null,null,null,"","//","//"]
[0,null,null,null,null,null,"","//","//"]
[0,null,null,null,null,null,"","//","//"]
[0,null,null,null,null,null,"","//","//"]
[0,null,null,null,null,null,"","//","//"]
[0,null,null,null,null,null,"","//","//"]
[0,null,null,null,null,null,"","//","//"]
[0,null,null,null,null,null,"","//","//"]
[0,null,null,null,null,null,"","//","//"]
[0,null,null,null,null,null,"","//","//"]
[0,null,null,null,null,null,"","//","//"]
[0,null,null,null,null,null,"","//","//"]
[0,null,null,null,null,null,"","//","//"]
[0,null,null,null,null,null,"","//","//"]
[0,null,null,null,null,null,"","//","//"]
[0,null,null,null,null,null,"","//","//"]
[0,null,null,null,null,null,"","//","//"]
[0,null,null,null,null,null,"","//","//"]
[0,null,null,null,null,null,"","//","//"]
[0,null,null,null,null,null,"","//","//"]
[0,null,null,null,null,null,"","//","//"]
[0,null,null,null,null,null,"","//","//"]
[0,null,null,null,null,null,"","//","//"]
[0,null,null,null,null,null,"","//","//"]
[0,null,null,null,null,null,"","//","//"]
[0,null,null,null,null,null,"","//","//"]
[0,null,null,null,null,null,"","//","//"]
[0,null,null,null,null,null,"","//","//"]
[0,null,null,null,null,null,"","//","//"]
[0,null,null,null,null,null,"","//","//"]
[0,null,null,null,null,null,"","//","//"]
[0,null,null,null,null,null,"","//","//"]
[0,null,null,null,null,null,"","//","//"]
[0,null,null,null,null,null,"","//","//"]
[0,null,null,null,null,null,"","//","//"]
[0,null,null,null,null,null,"","//","//"]
[0,null,null,null,null,null,"","//","//"]
[0,null,null,null,null,null,"","//","//"]
[0,null,null,null,null,null,"","//","//"]
[0,null,null,null,null,null,"","//","//"]
[0,null,null,null,null,null,"","//","//"]
[0,null,null,null,null,null,"","//","//"]
[0,null,null,null,null,null,"","//","//"]
[0,null,null,null,null,null,"","//","//"]
[0,null,null,null,null,null,"","//","//"]
[0,null,null,null,null,null,"","//","//"]
[0,null,null,null,null,null,"","//","//"]
[0,null,null,null,null,null,"","//","//"]
[0,null,null,null,null,null,"","//","//"]
[0,null,null,null,null,null,"","//","//"]
[0,null,null,null,null,null,"","//","//"]
[0,null,null,null,null,null,"","//","//"]
[0,null,null,null,null,null,"","//","//"]
[0,null,null,null,null,null,"",{"$f":"IF(OR($G832=\"NTSI\",$G832=\"TTSI\"),$E832,LEFT($E832,4)&\"/\"&MID($E832,5,2)&\"/\"&RIGHT($E832,2))","v":"//"},{"$f":"IF(OR($G832=\"NTSI\",$G832=\"TTSI\"),$F832,LEFT($F832,4)&\"/\"&MID($F832,5,2)&\"/\"&RIGHT($F832,2))","v":"//"}]
[0,null,null,null,null,null,"","//","//"]
[0,null,null,null,null,null,"","//","//"]
[0,null,null,null,null,null,"","//","//"]
[0,null,null,null,null,null,"","//","//"]
[{"$f":"IF(RIGHT(B837,1)=\"H\",LEFT(B837,11)&\"B\",B837)","v":0},null,null,null,null,null,{"$f":"MID(C837,4,4)","v":""},"//","//"]
[0,null,null,null,null,null,"","//","//"]
[0,null,null,null,null,null,"","//","//"]
[0,null,null,null,null,null,"","//","//"]
[0,null,null,null,null,null,"","//","//"]
[0,null,null,null,null,null,"","//","//"]
[0,null,null,null,null,null,"","//","//"]
[0,null,null,null,null,null,"","//","//"]
[0,null,null,null,null,null,"","//","//"]
[0,null,null,null,null,null,"","//","//"]
[0,null,null,null,null,null,"","//","//"]
[0,null,null,null,null,null,"","//","//"]
[0,null,null,null,null,null,"","//","//"]
[0,null,null,null,null,null,"","//","//"]
[0,null,null,null,null,null,"","//","//"]
[0,null,null,null,null,null,"","//","//"]
[0,null,null,null,null,null,"","//","//"]
[0,null,null,null,null,null,"","//","//"]
[0,null,null,null,null,null,"","//","//"]
[0,null,null,null,null,null,"","//","//"]
[0,null,null,null,null,null,"","//","//"]
[0,null,null,null,null,null,"","//","//"]
[0,null,null,null,null,null,"","//","//"]
[0,null,null,null,null,null,"","//","//"]
[0,null,null,null,null,null,"","//","//"]
[0,null,null,null,null,null,"","//","//"]
[0,null,null,null,null,null,"","//","//"]
[0,null,null,null,null,null,"","//","//"]
[0,null,null,null,null,null,"","//","//"]
[0,null,null,null,null,null,"","//","//"]
[0,null,null,null,null,null,"","//","//"]
[0,null,null,null,null,null,"","//","//"]
[0,null,null,null,null,null,"","//","//"]
[0,null,null,null,null,null,"","//","//"]
[0,null,null,null,null,null,"","//","//"]
[0,null,null,null,null,null,"","//","//"]
[0,null,null,null,null,null,"","//","//"]
[0,null,null,null,null,null,"","//","//"]
[0,null,null,null,null,null,"","//","//"]
[0,null,null,null,null,null,"","//","//"]
[0,null,null,null,null,null,"","//","//"]
[0,null,null,null,null,null,"","//","//"]
[0,null,null,null,null,null,"","//","//"]
[0,null,null,null,null,null,"","//","//"]
[0,null,null,null,null,null,"","//","//"]
[0,null,null,null,null,null,"","//","//"]
[0,null,null,null,null,null,"","//","//"]
[0,null,null,null,null,null,"","//","//"]
[0,null,null,null,null,null,"","//","//"]
[0,null,null,null,null,null,"","//","//"]
[0,null,null,null,null,null,"","//","//"]
[0,null,null,null,null,null,"","//","//"]
[0,null,null,null,null,null,"","//","//"]
[0,null,null,null,null,null,"","//","//"]
[0,null,null,null,null,null,"","//","//"]
[0,null,null,null,null,null,"","//","//"]
[0,null,null,null,null,null,"","//","//"]
[0,null,null,null,null,null,"","//","//"]
[0,null,null,null,null,null,"","//","//"]
[0,null,null,null,null,null,"",{"$f":"IF(OR($G896=\"NTSI\",$G896=\"TTSI\"),$E896,LEFT($E896,4)&\"/\"&MID($E896,5,2)&\"/\"&RIGHT($E896,2))","v":"//"},{"$f":"IF(OR($G896=\"NTSI\",$G896=\"TTSI\"),$F896,LEFT($F896,4)&\"/\"&MID($F896,5,2)&\"/\"&RIGHT($F896,2))","v":"//"}]
[0,null,null,null,null,null,"","//","//"]
[0,null,null,null,null,null,"","//","//"]
[0,null,null,null,null,null,"","//","//"]
[0,null,null,null,null,null,"","//","//"]
[{"$f":"IF(RIGHT(B901,1)=\"H\",LEFT(B901,11)&\"B\",B901)","v":0},null,null,null,null,null,{"$f":"MID(C901,4,4)","v":""},"//","//"]
[0,null,null,null,null,null,"","//","//"]
[0,null,null,null,null,null,"","//","//"]
[0,null,null,null,null,null,"","//","//"]
[0,null,null,null,null,null,"","//","//"]
[0,null,null,null,null,null,"","//","//"]
[0,null,null,null,null,null,"","//","//"]
[0,null,null,null,null,null,"","//","//"]
[0,null,null,null,null,null,"","//","//"]
[0,null,null,null,null,null,"","//","//"]
[0,null,null,null,null,null,"","//","//"]
[0,null,null,null,null,null,"","//","//"]
[0,null,null,null,null,null,"","//","//"]
[0,null,null,null,null,null,"","//","//"]
[0,null,null,null,null,null,"","//","//"]
[0,null,null,null,null,null,"","//","//"]
[0,null,null,null,null,null,"","//","//"]
[0,null,null,null,null,null,"","//","//"]
[0,null,null,null,null,null,"","//","//"]
[0,null,null,null,null,null,"","//","//"]
[0,null,null,null,null,null,"","//","//"]
[0,null,null,null,null,null,"","//","//"]
[0,null,null,null,null,null,"","//","//"]
[0,null,null,null,null,null,"","//","//"]
[0,null,null,null,null,null,"","//","//"]
[0,null,null,null,null,null,"","//","//"]
[0,null,null,null,null,null,"","//","//"]
[0,null,null,null,null,null,"","//","//"]
[0,null,null,null,null,null,"","//","//"]
[0,null,null,null,null,null,"","//","//"]
[0,null,null,null,null,null,"","//","//"]
[0,null,null,null,null,null,"","//","//"]
[0,null,null,null,null,null,"","//","//"]
[0,null,null,null,null,null,"","//","//"]
[0,null,null,null,null,null,"","//","//"]
[0,null,null,null,null,null,"","//","//"]
[0,null,null,null,null,null,"","//","//"]
[0,null,null,null,null,null,"","//","//"]
[0,null,null,null,null,null,"","//","//"]
[0,null,null,null,null,null,"","//","//"]
[0,null,null,null,null,null,"","//","//"]
[0,null,null,null,null,null,"","//","//"]
[0,null,null,null,null,null,"","//","//"]
[0,null,null,null,null,null,"","//","//"]
[0,null,null,null,null,null,"","//","//"]
[0,null,null,null,null,null,"","//","//"]
[0,null,null,null,null,null,"","//","//"]
[0,null,null,null,null,null,"","//","//"]
[0,null,null,null,null,null,"","//","//"]
[0,null,null,null,null,null,"","//","//"]
[0,null,null,null,null,null,"","//","//"]
[0,null,null,null,null,null,"","//","//"]
[0,null,null,null,null,null,"","//","//"]
[0,null,null,null,null,null,"","//","//"]
[0,null,null,null,null,null,"","//","//"]
[0,null,null,null,null,null,"","//","//"]
[0,null,null,null,null,null,"","//","//"]
[0,null,null,null,null,null,"","//","//"]
[0,null,null,null,null,null,"","//","//"]
[0,null,null,null,null,null,"",{"$f":"IF(OR($G960=\"NTSI\",$G960=\"TTSI\"),$E960,LEFT($E960,4)&\"/\"&MID($E960,5,2)&\"/\"&RIGHT($E960,2))","v":"//"},{"$f":"IF(OR($G960=\"NTSI\",$G960=\"TTSI\"),$F960,LEFT($F960,4)&\"/\"&MID($F960,5,2)&\"/\"&RIGHT($F960,2))","v":"//"}]
[0,null,null,null,null,null,"","//","//"]
[0,null,null,null,null,null,"","//","//"]
[0,null,null,null,null,null,"","//","//"]
[0,null,null,null,null,null,"","//","//"]
[{"$f":"IF(RIGHT(B965,1)=\"H\",LEFT(B965,11)&\"B\",B965)","v":0},null,null,null,null,null,{"$f":"MID(C965,4,4)","v":""},"//","//"]
[0,null,null,null,null,null,"","//","//"]
[0,null,null,null,null,null,"","//","//"]
[0,null,null,null,null,null,"","//","//"]
[0,null,null,null,null,null,"","//","//"]
[0,null,null,null,null,null,"","//","//"]
[0,null,null,null,null,null,"","//","//"]
[0,null,null,null,null,null,"","//","//"]
[0,null,null,null,null,null,"","//","//"]
[0,null,null,null,null,null,"","//","//"]
[0,null,null,null,null,null,"","//","//"]
[0,null,null,null,null,null,"","//","//"]
[0,null,null,null,null,null,"","//","//"]
[0,null,null,null,null,null,"","//","//"]
[0,null,null,null,null,null,"","//","//"]
[0,null,null,null,null,null,"","//","//"]
[0,null,null,null,null,null,"","//","//"]
[0,null,null,null,null,null,"","//","//"]
[0,null,null,null,null,null,"","//","//"]
[0,null,null,null,null,null,"","//","//"]
[0,null,null,null,null,null,"","//","//"]
[0,null,null,null,null,null,"","//","//"]
[0,null,null,null,null,null,"","//","//"]
[0,null,null,null,null,null,"","//","//"]
[0,null,null,null,null,null,"","//","//"]
[0,null,null,null,null,null,"","//","//"]
[0,null,null,null,null,null,"","//","//"]
[0,null,null,null,null,null,"","//","//"]
[0,null,null,null,null,null,"","//","//"]
[0,null,null,null,null,null,"","//","//"]
[0,null,null,null,null,null,"","//","//"]
[0,null,null,null,null,null,"","//","//"]
[0,null,null,null,null,null,"","//","//"]
[0,null,null,null,null,null,"","//","//"]
[0,null,null,null,null,null,"","//","//"]
[0,null,null,null,null,null,"","//","//"]
[0,null,null,null,null,null,"","//","//"]
[0,null,null,null,null,null,"","//","//"]
[0,null,null,null,null,null,"","//","//"]
[0,null,null,null,null,null,"","//","//"]
[0,null,null,null,null,null,"","//","//"]
[0,null,null,null,null,null,"","//","//"]
[0,null,null,null,null,null,"","//","//"]
[0,null,null,null,null,null,"","//","//"]
[0,null,null,null,null,null,"","//","//"]
[0,null,null,null,null,null,"","//","//"]
[0,null,null,null,null,null,"","//","//"]
[0,null,null,null,null,null,"","//","//"]
[0,null,null,null,null,null,"","//","//"]
[0,null,null,null,null,null,"","//","//"]
[0,null,null,null,null,null,"","//","//"]
[0,null,null,null,null,null,"","//","//"]
[0,null,null,null,null,null,"","//","//"]
[0,null,null,null,null,null,"","//","//"]
[0,null,null,null,null,null,"","//","//"]
[0,null,null,null,null,null,"","//","//"]
[0,null,null,null,null,null,"","//","//"]
[0,null,null,null,null,null,"","//","//"]
[0,null,null,null,null,null,"","//","//"]
[0,null,null,null,null,null,"",{"$f":"IF(OR($G1024=\"NTSI\",$G1024=\"TTSI\"),$E1024,LEFT($E1024,4)&\"/\"&MID($E1024,5,2)&\"/\"&RIGHT($E1024,2))","v":"//"},{"$f":"IF(OR($G1024=\"NTSI\",$G1024=\"TTSI\"),$F1024,LEFT($F1024,4)&\"/\"&MID($F1024,5,2)&\"/\"&RIGHT($F1024,2))","v":"//"}]
[0,null,null,null,null,null,"","//","//"]
[0,null,null,null,null,null,"","//","//"]
[0,null,null,null,null,null,"","//","//"]
[0,null,null,null,null,null,"","//","//"]
[{"$f":"IF(RIGHT(B1029,1)=\"H\",LEFT(B1029,11)&\"B\",B1029)","v":0},null,null,null,null,null,{"$f":"MID(C1029,4,4)","v":""},"//","//"]
[0,null,null,null,null,null,"","//","//"]
[0,null,null,null,null,null,"","//","//"]
[0,null,null,null,null,null,"","//","//"]
[0,null,null,null,null,null,"","//","//"]
[0,null,null,null,null,null,"","//","//"]
[0,null,null,null,null,null,"","//","//"]
[0,null,null,null,null,null,"","//","//"]
[0,null,null,null,null,null,"","//","//"]
[0,null,null,null,null,null,"","//","//"]
[0,null,null,null,null,null,"","//","//"]
[0,null,null,null,null,null,"","//","//"]
[0,null,null,null,null,null,"","//","//"]
[0,null,null,null,null,null,"","//","//"]
[0,null,null,null,null,null,"","//","//"]
[0,null,null,null,null,null,"","//","//"]
[0,null,null,null,null,null,"","//","//"]
[0,null,null,null,null,null,"","//","//"]
[0,null,null,null,null,null,"","//","//"]
[0,null,null,null,null,null,"","//","//"]
[0,null,null,null,null,null,"","//","//"]
[0,null,null,null,null,null,"","//","//"]
[0,null,null,null,null,null,"","//","//"]
[0,null,null,null,null,null,"","//","//"]
[0,null,null,null,null,null,"","//","//"]
[0,null,null,null,null,null,"","//","//"]
[0,null,null,null,null,null,"","//","//"]
[0,null,null,null,null,null,"","//","//"]
[0,null,null,null,null,null,"","//","//"]
[0,null,null,null,null,null,"","//","//"]
[0,null,null,null,null,null,"","//","//"]
[0,null,null,null,null,null,"","//","//"]
[0,null,null,null,null,null,"","//","//"]
[0,null,null,null,null,null,"","//","//"]
[0,null,null,null,null,null,"","//","//"]
[0,null,null,null,null,null,"","//","//"]
[0,null,null,null,null,null,"","//","//"]
[0,null,null,null,null,null,"","//","//"]
[0,null,null,null,null,null,"","//","//"]
[0,null,null,null,null,null,"","//","//"]
[0,null,null,null,null,null,"","//","//"]
[0,null,null,null,null,null,"","//","//"]
[0,null,null,null,null,null,"","//","//"]
[0,null,null,null,null,null,"","//","//"]
[0,null,null,null,null,null,"","//","//"]
[0,null,null,null,null,null,"","//","//"]
[0,null,null,null,null,null,"","//","//"]
[0,null,null,null,null,null,"","//","//"]
[0,null,null,null,null,null,"","//","//"]
[0,null,null,null,null,null,"","//","//"]
[0,null,null,null,null,null,"","//","//"]
[0,null,null,null,null,null,"","//","//"]
[0,null,null,null,null,null,"","//","//"]
[0,null,null,null,null,null,"","//","//"]
[0,null,null,null,null,null,"","//","//"]
[0,null,null,null,null,null,"","//","//"]
[0,null,null,null,null,null,"","//","//"]
[0,null,null,null,null,null,"","//","//"]
[0,null,null,null,null,null,"","//","//"]
[0,null,null,null,null,null,"",{"$f":"IF(OR($G1088=\"NTSI\",$G1088=\"TTSI\"),$E1088,LEFT($E1088,4)&\"/\"&MID($E1088,5,2)&\"/\"&RIGHT($E1088,2))","v":"//"},{"$f":"IF(OR($G1088=\"NTSI\",$G1088=\"TTSI\"),$F1088,LEFT($F1088,4)&\"/\"&MID($F1088,5,2)&\"/\"&RIGHT($F1088,2))","v":"//"}]
[0,null,null,null,null,null,"","//","//"]
[0,null,null,null,null,null,"","//","//"]
[0,null,null,null,null,null,"","//","//"]
[0,null,null,null,null,null,"","//","//"]
[{"$f":"IF(RIGHT(B1093,1)=\"H\",LEFT(B1093,11)&\"B\",B1093)","v":0},null,null,null,null,null,{"$f":"MID(C1093,4,4)","v":""},"//","//"]
[0,null,null,null,null,null,"","//","//"]
[0,null,null,null,null,null,"","//","//"]
[0,null,null,null,null,null,"","//","//"]
[0,null,null,null,null,null,"","//","//"]
[0,null,null,null,null,null,"","//","//"]
[0,null,null,null,null,null,"","//","//"]
[0,null,null,null,null,null,"","//","//"]
[0,null,null,null,null,null,"","//","//"]
[0,null,null,null,null,null,"","//","//"]
[0,null,null,null,null,null,"","//","//"]
[0,null,null,null,null,null,"","//","//"]
[0,null,null,null,null,null,"","//","//"]
[0,null,null,null,null,null,"","//","//"]
[0,null,null,null,null,null,"","//","//"]
[0,null,null,null,null,null,"","//","//"]
[0,null,null,null,null,null,"","//","//"]
[0,null,null,null,null,null,"","//","//"]
[0,null,null,null,null,null,"","//","//"]
[0,null,null,null,null,null,"","//","//"]
[0,null,null,null,null,null,"","//","//"]
[0,null,null,null,null,null,"","//","//"]
[0,null,null,null,null,null,"","//","//"]
[0,null,null,null,null,null,"","//","//"]
[0,null,null,null,null,null,"","//","//"]
[0,null,null,null,null,null,"","//","//"]
[0,null,null,null,null,null,"","//","//"]
[0,null,null,null,null,null,"","//","//"]
[0,null,null,null,null,null,"","//","//"]
[0,null,null,null,null,null,"","//","//"]
[0,null,null,null,null,null,"","//","//"]
[0,null,null,null,null,null,"","//","//"]
[0,null,null,null,null,null,"","//","//"]
[0,null,null,null,null,null,"","//","//"]
[0,null,null,null,null,null,"","//","//"]
[0,null,null,null,null,null,"","//","//"]
[0,null,null,null,null,null,"","//","//"]
[0,null,null,null,null,null,"","//","//"]
[0,null,null,null,null,null,"","//","//"]
[0,null,null,null,null,null,"","//","//"]
[0,null,null,null,null,null,"","//","//"]
[0,null,null,null,null,null,"","//","//"]
[0,null,null,null,null,null,"","//","//"]
[0,null,null,null,null,null,"","//","//"]
[0,null,null,null,null,null,"","//","//"]
[0,null,null,null,null,null,"","//","//"]
[0,null,null,null,null,null,"","//","//"]
[0,null,null,null,null,null,"","//","//"]
[0,null,null,null,null,null,"","//","//"]
[0,null,null,null,null,null,"","//","//"]
[0,null,null,null,null,null,"","//","//"]
[0,null,null,null,null,null,"","//","//"]
[0,null,null,null,null,null,"","//","//"]
[0,null,null,null,null,null,"","//","//"]
[0,null,null,null,null,null,"","//","//"]
[0,null,null,null,null,null,"","//","//"]
[0,null,null,null,null,null,"","//","//"]
[0,null,null,null,null,null,"","//","//"]
[0,null,null,null,null,null,"","//","//"]
[0,null,null,null,null,null,"",{"$f":"IF(OR($G1152=\"NTSI\",$G1152=\"TTSI\"),$E1152,LEFT($E1152,4)&\"/\"&MID($E1152,5,2)&\"/\"&RIGHT($E1152,2))","v":"//"},{"$f":"IF(OR($G1152=\"NTSI\",$G1152=\"TTSI\"),$F1152,LEFT($F1152,4)&\"/\"&MID($F1152,5,2)&\"/\"&RIGHT($F1152,2))","v":"//"}]
[0,null,null,null,null,null,"","//","//"]
[0,null,null,null,null,null,"","//","//"]
[0,null,null,null,null,null,"","//","//"]
[0,null,null,null,null,null,"","//","//"]
[{"$f":"IF(RIGHT(B1157,1)=\"H\",LEFT(B1157,11)&\"B\",B1157)","v":0},null,null,null,null,null,{"$f":"MID(C1157,4,4)","v":""},"//","//"]
[0,null,null,null,null,null,"","//","//"]
[0,null,null,null,null,null,"","//","//"]
[0,null,null,null,null,null,"","//","//"]
[0,null,null,null,null,null,"","//","//"]
[0,null,null,null,null,null,"","//","//"]
[0,null,null,null,null,null,"","//","//"]
[0,null,null,null,null,null,"","//","//"]
[0,null,null,null,null,null,"","//","//"]
[0,null,null,null,null,null,"","//","//"]
[0,null,null,null,null,null,"","//","//"]
[0,null,null,null,null,null,"","//","//"]
[0,null,null,null,null,null,"","//","//"]
[0,null,null,null,null,null,"","//","//"]
[0,null,null,null,null,null,"","//","//"]
[0,null,null,null,null,null,"","//","//"]
[0,null,null,null,null,null,"","//","//"]
[0,null,null,null,null,null,"","//","//"]
[0,null,null,null,null,null,"","//","//"]
[0,null,null,null,null,null,"","//","//"]
[0,null,null,null,null,null,"","//","//"]
[0,null,null,null,null,null,"","//","//"]
[0,null,null,null,null,null,"","//","//"]
[0,null,null,null,null,null,"","//","//"]
[0,null,null,null,null,null,"","//","//"]
[0,null,null,null,null,null,"","//","//"]
[0,null,null,null,null,null,"","//","//"]
[0,null,null,null,null,null,"","//","//"]
[0,null,null,null,null,null,"","//","//"]
[0,null,null,null,null,null,"","//","//"]
[0,null,null,null,null,null,"","//","//"]
[0,null,null,null,null,null,"","//","//"]
[0,null,null,null,null,null,"","//","//"]
[0,null,null,null,null,null,"","//","//"]
[0,null,null,null,null,null,"","//","//"]
[0,null,null,null,null,null,"","//","//"]
[0,null,null,null,null,null,"","//","//"]
[0,null,null,null,null,null,"","//","//"]
[0,null,null,null,null,null,"","//","//"]
[0,null,null,null,null,null,"","//","//"]
[0,null,null,null,null,null,"","//","//"]
[0,null,null,null,null,null,"","//","//"]
[0,null,null,null,null,null,"","//","//"]
[0,null,null,null,null,null,"","//","//"]
[0,null,null,null,null,null,"","//","//"]
[0,null,null,null,null,null,"","//","//"]
[0,null,null,null,null,null,"","//","//"]
[0,null,null,null,null,null,"","//","//"]
[0,null,null,null,null,null,"","//","//"]
[0,null,null,null,null,null,"","//","//"]
[0,null,null,null,null,null,"","//","//"]
[0,null,null,null,null,null,"","//","//"]
[0,null,null,null,null,null,"","//","//"]
[0,null,null,null,null,null,"","//","//"]
[0,null,null,null,null,null,"","//","//"]
[0,null,null,null,null,null,"","//","//"]
[0,null,null,null,null,null,"","//","//"]
[0,null,null,null,null,null,"","//","//"]
[0,null,null,null,null,null,"","//","//"]
[0,null,null,null,null,null,"",{"$f":"IF(OR($G1216=\"NTSI\",$G1216=\"TTSI\"),$E1216,LEFT($E1216,4)&\"/\"&MID($E1216,5,2)&\"/\"&RIGHT($E1216,2))","v":"//"},{"$f":"IF(OR($G1216=\"NTSI\",$G1216=\"TTSI\"),$F1216,LEFT($F1216,4)&\"/\"&MID($F1216,5,2)&\"/\"&RIGHT($F1216,2))","v":"//"}]
[0,null,null,null,null,null,"","//","//"]
[0,null,null,null,null,null,"","//","//"]
[0,null,null,null,null,null,"","//","//"]
[0,null,null,null,null,null,"","//","//"]
[{"$f":"IF(RIGHT(B1221,1)=\"H\",LEFT(B1221,11)&\"B\",B1221)","v":0},null,null,null,null,null,{"$f":"MID(C1221,4,4)","v":""},"//","//"]
[0,null,null,null,null,null,"","//","//"]
[0,null,null,null,null,null,"","//","//"]
[0,null,null,null,null,null,"","//","//"]
[0,null,null,null,null,null,"","//","//"]
[0,null,null,null,null,null,"","//","//"]
[0,null,null,null,null,null,"","//","//"]
[0,null,null,null,null,null,"","//","//"]
[0,null,null,null,null,null,"","//","//"]
[0,null,null,null,null,null,"","//","//"]
[0,null,null,null,null,null,"","//","//"]
[0,null,null,null,null,null,"","//","//"]
[0,null,null,null,null,null,"","//","//"]
[0,null,null,null,null,null,"","//","//"]
[0,null,null,null,null,null,"","//","//"]
[0,null,null,null,null,null,"","//","//"]
[0,null,null,null,null,null,"","//","//"]
[0,null,null,null,null,null,"","//","//"]
[0,null,null,null,null,null,"","//","//"]
[0,null,null,null,null,null,"","//","//"]
[0,null,null,null,null,null,"","//","//"]
[0,null,null,null,null,null,"","//","//"]
[0,null,null,null,null,null,"","//","//"]
[0,null,null,null,null,null,"","//","//"]
[0,null,null,null,null,null,"","//","//"]
[0,null,null,null,null,null,"","//","//"]
[0,null,null,null,null,null,"","//","//"]
[0,null,null,null,null,null,"","//","//"]
[0,null,null,null,null,null,"","//","//"]
[0,null,null,null,null,null,"","//","//"]
[0,null,null,null,null,null,"","//","//"]
[0,null,null,null,null,null,"","//","//"]
[0,null,null,null,null,null,"","//","//"]
[0,null,null,null,null,null,"","//","//"]
[0,null,null,null,null,null,"","//","//"]
[0,null,null,null,null,null,"","//","//"]
[0,null,null,null,null,null,"","//","//"]
[0,null,null,null,null,null,"","//","//"]
[0,null,null,null,null,null,"","//","//"]
[0,null,null,null,null,null,"","//","//"]
[0,null,null,null,null,null,"","//","//"]
[0,null,null,null,null,null,"","//","//"]
[0,null,null,null,null,null,"","//","//"]
[0,null,null,null,null,null,"","//","//"]
[0,null,null,null,null,null,"","//","//"]
[0,null,null,null,null,null,"","//","//"]
[0,null,null,null,null,null,"","//","//"]
[0,null,null,null,null,null,"","//","//"]
[0,null,null,null,null,null,"","//","//"]
[0,null,null,null,null,null,"","//","//"]
[0,null,null,null,null,null,"","//","//"]
[0,null,null,null,null,null,"","//","//"]
[0,null,null,null,null,null,"","//","//"]
[0,null,null,null,null,null,"","//","//"]
[0,null,null,null,null,null,"","//","//"]
[0,null,null,null,null,null,"","//","//"]
[0,null,null,null,null,null,"","//","//"]
[0,null,null,null,null,null,"","//","//"]
[0,null,null,null,null,null,"","//","//"]
[0,null,null,null,null,null,"",{"$f":"IF(OR($G1280=\"NTSI\",$G1280=\"TTSI\"),$E1280,LEFT($E1280,4)&\"/\"&MID($E1280,5,2)&\"/\"&RIGHT($E1280,2))","v":"//"},{"$f":"IF(OR($G1280=\"NTSI\",$G1280=\"TTSI\"),$F1280,LEFT($F1280,4)&\"/\"&MID($F1280,5,2)&\"/\"&RIGHT($F1280,2))","v":"//"}]
[0,null,null,null,null,null,"","//","//"]
[0,null,null,null,null,null,"","//","//"]
[0,null,null,null,null,null,"","//","//"]
[0,null,null,null,null,null,"","//","//"]
[{"$f":"IF(RIGHT(B1285,1)=\"H\",LEFT(B1285,11)&\"B\",B1285)","v":0},null,null,null,null,null,{"$f":"MID(C1285,4,4)","v":""},"//","//"]
[0,null,null,null,null,null,"","//","//"]
[0,null,null,null,null,null,"","//","//"]
[0,null,null,null,null,null,"","//","//"]
[0,null,null,null,null,null,"","//","//"]
[0,null,null,null,null,null,"","//","//"]
[0,null,null,null,null,null,"","//","//"]
[0,null,null,null,null,null,"","//","//"]
[0,null,null,null,null,null,"","//","//"]
[0,null,null,null,null,null,"","//","//"]
[0,null,null,null,null,null,"","//","//"]
[0,null,null,null,null,null,"","//","//"]
[0,null,null,null,null,null,"","//","//"]
[0,null,null,null,null,null,"","//","//"]
[0,null,null,null,null,null,"","//","//"]
[0,null,null,null,null,null,"","//","//"]
[0,null,null,null,null,null,"","//","//"]
[0,null,null,null,null,null,"","//","//"]
[0,null,null,null,null,null,"","//","//"]
[0,null,null,null,null,null,"","//","//"]
[0,null,null,null,null,null,"","//","//"]
[0,null,null,null,null,null,"","//","//"]
[0,null,null,null,null,null,"","//","//"]
[0,null,null,null,null,null,"","//","//"]
[0,null,null,null,null,null,"","//","//"]
[0,null,null,null,null,null,"","//","//"]
[0,null,null,null,null,null,"","//","//"]
[0,null,null,null,null,null,"","//","//"]
[0,null,null,null,null,null,"","//","//"]
[0,null,null,null,null,null,"","//","//"]
[0,null,null,null,null,null,"","//","//"]
[0,null,null,null,null,null,"","//","//"]
[0,null,null,null,null,null,"","//","//"]
[0,null,null,null,null,null,"","//","//"]
[0,null,null,null,null,null,"","//","//"]
[0,null,null,null,null,null,"","//","//"]
[0,null,null,null,null,null,"","//","//"]
[0,null,null,null,null,null,"","//","//"]
[0,null,null,null,null,null,"","//","//"]
[0,null,null,null,null,null,"","//","//"]
[0,null,null,null,null,null,"","//","//"]
[0,null,null,null,null,null,"","//","//"]
[0,null,null,null,null,null,"","//","//"]
[0,null,null,null,null,null,"","//","//"]
[0,null,null,null,null,null,"","//","//"]
[0,null,null,null,null,null,"","//","//"]
[0,null,null,null,null,null,"","//","//"]
[0,null,null,null,null,null,"","//","//"]
[0,null,null,null,null,null,"","//","//"]
[0,null,null,null,null,null,"","//","//"]
[0,null,null,null,null,null,"","//","//"]
[0,null,null,null,null,null,"","//","//"]
[0,null,null,null,null,null,"","//","//"]
[0,null,null,null,null,null,"","//","//"]
[0,null,null,null,null,null,"","//","//"]
[0,null,null,null,null,null,"","//","//"]
[0,null,null,null,null,null,"","//","//"]
[0,null,null,null,null,null,"","//","//"]
[0,null,null,null,null,null,"","//","//"]
[0,null,null,null,null,null,"",{"$f":"IF(OR($G1344=\"NTSI\",$G1344=\"TTSI\"),$E1344,LEFT($E1344,4)&\"/\"&MID($E1344,5,2)&\"/\"&RIGHT($E1344,2))","v":"//"},{"$f":"IF(OR($G1344=\"NTSI\",$G1344=\"TTSI\"),$F1344,LEFT($F1344,4)&\"/\"&MID($F1344,5,2)&\"/\"&RIGHT($F1344,2))","v":"//"}]
[0,null,null,null,null,null,"","//","//"]
[0,null,null,null,null,null,"","//","//"]
[0,null,null,null,null,null,"","//","//"]
[0,null,null,null,null,null,"","//","//"]
[{"$f":"IF(RIGHT(B1349,1)=\"H\",LEFT(B1349,11)&\"B\",B1349)","v":0},null,null,null,null,null,{"$f":"MID(C1349,4,4)","v":""},"//","//"]
[0,null,null,null,null,null,"","//","//"]
[0,null,null,null,null,null,"","//","//"]
[0,null,null,null,null,null,"","//","//"]
[0,null,null,null,null,null,"","//","//"]
[0,null,null,null,null,null,"","//","//"]
[0,null,null,null,null,null,"","//","//"]
[0,null,null,null,null,null,"","//","//"]
[0,null,null,null,null,null,"","//","//"]
[0,null,null,null,null,null,"","//","//"]
[0,null,null,null,null,null,"","//","//"]
[0,null,null,null,null,null,"","//","//"]
[0,null,null,null,null,null,"","//","//"]
[0,null,null,null,null,null,"","//","//"]
[0,null,null,null,null,null,"","//","//"]
[0,null,null,null,null,null,"","//","//"]
[0,null,null,null,null,null,"","//","//"]
[0,null,null,null,null,null,"","//","//"]
[0,null,null,null,null,null,"","//","//"]
[0,null,null,null,null,null,"","//","//"]
[0,null,null,null,null,null,"","//","//"]
[0,null,null,null,null,null,"","//","//"]
[0,null,null,null,null,null,"","//","//"]
[0,null,null,null,null,null,"","//","//"]
[0,null,null,null,null,null,"","//","//"]
[0,null,null,null,null,null,"","//","//"]
[0,null,null,null,null,null,"","//","//"]
[0,null,null,null,null,null,"","//","//"]
[0,null,null,null,null,null,"","//","//"]
[0,null,null,null,null,null,"","//","//"]
[0,null,null,null,null,null,"","//","//"]
[0,null,null,null,null,null,"","//","//"]
[0,null,null,null,null,null,"","//","//"]
[0,null,null,null,null,null,"","//","//"]
[0,null,null,null,null,null,"","//","//"]
[0,null,null,null,null,null,"","//","//"]
[0,null,null,null,null,null,"","//","//"]
[0,null,null,null,null,null,"","//","//"]
[0,null,null,null,null,null,"","//","//"]
[0,null,null,null,null,null,"","//","//"]
[0,null,null,null,null,null,"","//","//"]
[0,null,null,null,null,null,"","//","//"]
[0,null,null,null,null,null,"","//","//"]
[0,null,null,null,null,null,"","//","//"]
[0,null,null,null,null,null,"","//","//"]
[0,null,null,null,null,null,"","//","//"]
[0,null,null,null,null,null,"","//","//"]
[0,null,null,null,null,null,"","//","//"]
[0,null,null,null,null,null,"","//","//"]
[0,null,null,null,null,null,"","//","//"]
[0,null,null,null,null,null,"","//","//"]
[0,null,null,null,null,null,"","//","//"]
[0,null,null,null,null,null,"","//","//"]
[0,null,null,null,null,null,"","//","//"]
[0,null,null,null,null,null,"","//","//"]
[0,null,null,null,null,null,"","//","//"]
[0,null,null,null,null,null,"","//","//"]
[0,null,null,null,null,null,"","//","//"]
[0,null,null,null,null,null,"","//","//"]
[0,null,null,null,null,null,"",{"$f":"IF(OR($G1408=\"NTSI\",$G1408=\"TTSI\"),$E1408,LEFT($E1408,4)&\"/\"&MID($E1408,5,2)&\"/\"&RIGHT($E1408,2))","v":"//"},{"$f":"IF(OR($G1408=\"NTSI\",$G1408=\"TTSI\"),$F1408,LEFT($F1408,4)&\"/\"&MID($F1408,5,2)&\"/\"&RIGHT($F1408,2))","v":"//"}]
[0,null,null,null,null,null,"","//","//"]
[0,null,null,null,null,null,"","//","//"]
[0,null,null,null,null,null,"","//","//"]
[0,null,null,null,null,null,"","//","//"]
[{"$f":"IF(RIGHT(B1413,1)=\"H\",LEFT(B1413,11)&\"B\",B1413)","v":0},null,null,null,null,null,{"$f":"MID(C1413,4,4)","v":""},"//","//"]
[0,null,null,null,null,null,"","//","//"]
[0,null,null,null,null,null,"","//","//"]
[0,null,null,null,null,null,"","//","//"]
[0,null,null,null,null,null,"","//","//"]
[0,null,null,null,null,null,"","//","//"]
[0,null,null,null,null,null,"","//","//"]
[0,null,null,null,null,null,"","//","//"]
[0,null,null,null,null,null,"","//","//"]
[0,null,null,null,null,null,"","//","//"]
[0,null,null,null,null,null,"","//","//"]
[0,null,null,null,null,null,"","//","//"]
[0,null,null,null,null,null,"","//","//"]
[0,null,null,null,null,null,"","//","//"]
[0,null,null,null,null,null,"","//","//"]
[0,null,null,null,null,null,"","//","//"]
[0,null,null,null,null,null,"","//","//"]
[0,null,null,null,null,null,"","//","//"]
[0,null,null,null,null,null,"","//","//"]
[0,null,null,null,null,null,"","//","//"]
[0,null,null,null,null,null,"","//","//"]
[0,null,null,null,null,null,"","//","//"]
[0,null,null,null,null,null,"","//","//"]
[0,null,null,null,null,null,"","//","//"]
[0,null,null,null,null,null,"","//","//"]
[0,null,null,null,null,null,"","//","//"]
[0,null,null,null,null,null,"","//","//"]
[0,null,null,null,null,null,"","//","//"]
[0,null,null,null,null,null,"","//","//"]
[0,null,null,null,null,null,"","//","//"]
[0,null,null,null,null,null,"","//","//"]
[0,null,null,null,null,null,"","//","//"]
[0,null,null,null,null,null,"","//","//"]
[0,null,null,null,null,null,"","//","//"]
[0,null,null,null,null,null,"","//","//"]
[0,null,null,null,null,null,"","//","//"]
[0,null,null,null,null,null,"","//","//"]
[0,null,null,null,null,null,"","//","//"]
[0,null,null,null,null,null,"","//","//"]
[0,null,null,null,null,null,"","//","//"]
[0,null,null,null,null,null,"","//","//"]
[0,null,null,null,null,null,"","//","//"]
[0,null,null,null,null,null,"","//","//"]
[0,null,null,null,null,null,"","//","//"]
[0,null,null,null,null,null,"","//","//"]
[0,null,null,null,null,null,"","//","//"]
[0,null,null,null,null,null,"","//","//"]
[0,null,null,null,null,null,"","//","//"]
[0,null,null,null,null,null,"","//","//"]
[0,null,null,null,null,null,"","//","//"]
[0,null,null,null,null,null,"","//","//"]
[0,null,null,null,null,null,"","//","//"]
[0,null,null,null,null,null,"","//","//"]
[0,null,null,null,null,null,"","//","//"]
[0,null,null,null,null,null,"","//","//"]
[0,null,null,null,null,null,"","//","//"]
[0,null,null,null,null,null,"","//","//"]
[0,null,null,null,null,null,"","//","//"]
[0,null,null,null,null,null,"","//","//"]
[0,null,null,null,null,null,"",{"$f":"IF(OR($G1472=\"NTSI\",$G1472=\"TTSI\"),$E1472,LEFT($E1472,4)&\"/\"&MID($E1472,5,2)&\"/\"&RIGHT($E1472,2))","v":"//"},{"$f":"IF(OR($G1472=\"NTSI\",$G1472=\"TTSI\"),$F1472,LEFT($F1472,4)&\"/\"&MID($F1472,5,2)&\"/\"&RIGHT($F1472,2))","v":"//"}]
[0,null,null,null,null,null,"","//","//"]
[0,null,null,null,null,null,"","//","//"]
[0,null,null,null,null,null,"","//","//"]
[0,null,null,null,null,null,"","//","//"]
[{"$f":"IF(RIGHT(B1477,1)=\"H\",LEFT(B1477,11)&\"B\",B1477)","v":0},null,null,null,null,null,{"$f":"MID(C1477,4,4)","v":""},"//","//"]
[0,null,null,null,null,null,"","//","//"]
[0,null,null,null,null,null,"","//","//"]
[0,null,null,null,null,null,"","//","//"]
[0,null,null,null,null,null,"","//","//"]
[0,null,null,null,null,null,"","//","//"]
[0,null,null,null,null,null,"","//","//"]
[0,null,null,null,null,null,"","//","//"]
[0,null,null,null,null,null,"","//","//"]
[0,null,null,null,null,null,"","//","//"]
[0,null,null,null,null,null,"","//","//"]
[0,null,null,null,null,null,"","//","//"]
[0,null,null,null,null,null,"","//","//"]
[0,null,null,null,null,null,"","//","//"]
[0,null,null,null,null,null,"","//","//"]
[0,null,null,null,null,null,"","//","//"]
[0,null,null,null,null,null,"","//","//"]
[0,null,null,null,null,null,"","//","//"]
[0,null,null,null,null,null,"","//","//"]
[0,null,null,null,null,null,"","//","//"]
[0,null,null,null,null,null,"","//","//"]
[0,null,null,null,null,null,"","//","//"]
[0,null,null,null,null,null,"","//","//"]
[0,null,null,null,null,null,"","//","//"]
[0,null,null,null,null,null,"","//","//"]
[0,null,null,null,null,null,"","//","//"]
[0,null,null,null,null,null,"","//","//"]
[0,null,null,null,null,null,"","//","//"]
[0,null,null,null,null,null,"","//","//"]
[0,null,null,null,null,null,"","//","//"]
[0,null,null,null,null,null,"","//","//"]
[0,null,null,null,null,null,"","//","//"]
[0,null,null,null,null,null,"","//","//"]
[0,null,null,null,null,null,"","//","//"]
[0,null,null,null,null,null,"","//","//"]
[0,null,null,null,null,null,"","//","//"]
[0,null,null,null,null,null,"","//","//"]
[0,null,null,null,null,null,"","//","//"]
[0,null,null,null,null,null,"","//","//"]
[0,null,null,null,null,null,"","//","//"]
[0,null,null,null,null,null,"","//","//"]
[0,null,null,null,null,null,"","//","//"]
[0,null,null,null,null,null,"","//","//"]
[0,null,null,null,null,null,"","//","//"]
[0,null,null,null,null,null,"","//","//"]
[0,null,null,null,null,null,"","//","//"]
[0,null,null,null,null,null,"","//","//"]
[0,null,null,null,null,null,"","//","//"]
[0,null,null,null,null,null,"","//","//"]
[0,null,null,null,null,null,"","//","//"]
[0,null,null,null,null,null,"","//","//"]
[0,null,null,null,null,null,"","//","//"]
[0,null,null,null,null,null,"","//","//"]
[0,null,null,null,null,null,"","//","//"]
[0,null,null,null,null,null,"","//","//"]
[0,null,null,null,null,null,"","//","//"]
[0,null,null,null,null,null,"","//","//"]
[0,null,null,null,null,null,"","//","//"]
[0,null,null,null,null,null,"","//","//"]
[0,null,null,null,null,null,"",{"$f":"IF(OR($G1536=\"NTSI\",$G1536=\"TTSI\"),$E1536,LEFT($E1536,4)&\"/\"&MID($E1536,5,2)&\"/\"&RIGHT($E1536,2))","v":"//"},{"$f":"IF(OR($G1536=\"NTSI\",$G1536=\"TTSI\"),$F1536,LEFT($F1536,4)&\"/\"&MID($F1536,5,2)&\"/\"&RIGHT($F1536,2))","v":"//"}]
[0,null,null,null,null,null,"","//","//"]
[0,null,null,null,null,null,"","//","//"]
[0,null,null,null,null,null,"","//","//"]
[0,null,null,null,null,null,"","//","//"]
[{"$f":"IF(RIGHT(B1541,1)=\"H\",LEFT(B1541,11)&\"B\",B1541)","v":0},null,null,null,null,null,{"$f":"MID(C1541,4,4)","v":""},"//","//"]
[0,null,null,null,null,null,"","//","//"]
[0,null,null,null,null,null,"","//","//"]
[0,null,null,null,null,null,"","//","//"]
[0,null,null,null,null,null,"","//","//"]
[0,null,null,null,null,null,"","//","//"]
[0,null,null,null,null,null,"","//","//"]
[0,null,null,null,null,null,"","//","//"]
[0,null,null,null,null,null,"","//","//"]
[0,null,null,null,null,null,"","//","//"]
[0,null,null,null,null,null,"","//","//"]
[0,null,null,null,null,null,"","//","//"]
[0,null,null,null,null,null,"","//","//"]
[0,null,null,null,null,null,"","//","//"]
[0,null,null,null,null,null,"","//","//"]
[0,null,null,null,null,null,"","//","//"]
[0,null,null,null,null,null,"","//","//"]
[0,null,null,null,null,null,"","//","//"]
[0,null,null,null,null,null,"","//","//"]
[0,null,null,null,null,null,"","//","//"]
[0,null,null,null,null,null,"","//","//"]
[0,null,null,null,null,null,"","//","//"]
[0,null,null,null,null,null,"","//","//"]
[0,null,null,null,null,null,"","//","//"]
[0,null,null,null,null,null,"","//","//"]
[0,null,null,null,null,null,"","//","//"]
[0,null,null,null,null,null,"","//","//"]
[0,null,null,null,null,null,"","//","//"]
[0,null,null,null,null,null,"","//","//"]
[0,null,null,null,null,null,"","//","//"]
[0,null,null,null,null,null,"","//","//"]
[0,null,null,null,null,null,"","//","//"]
[0,null,null,null,null,null,"","//","//"]
[0,null,null,null,null,null,"","//","//"]
[0,null,null,null,null,null,"","//","//"]
[0,null,null,null,null,null,"","//","//"]
[0,null,null,null,null,null,"","//","//"]
[0,null,null,null,null,null,"","//","//"]
[0,null,null,null,null,null,"","//","//"]
[0,null,null,null,null,null,"","//","//"]
[0,null,null,null,null,null,"","//","//"]
[0,null,null,null,null,null,"","//","//"]
[0,null,null,null,null,null,"","//","//"]
[0,null,null,null,null,null,"","//","//"]
[0,null,null,null,null,null,"","//","//"]
[0,null,null,null,null,null,"","//","//"]
[0,null,null,null,null,null,"","//","//"]
[0,null,null,null,null,null,"","//","//"]
[0,null,null,null,null,null,"","//","//"]
[0,null,null,null,null,null,"","//","//"]
[0,null,null,null,null,null,"","//","//"]
[0,null,null,null,null,null,"","//","//"]
[0,null,null,null,null,null,"","//","//"]
[0,null,null,null,null,null,"","//","//"]
[0,null,null,null,null,null,"","//","//"]
[0,null,null,null,null,null,"","//","//"]
[0,null,null,null,null,null,"","//","//"]
[0,null,null,null,null,null,"","//","//"]
[0,null,null,null,null,null,"","//","//"]
[0,null,null,null,null,null,"",{"$f":"IF(OR($G1600=\"NTSI\",$G1600=\"TTSI\"),$E1600,LEFT($E1600,4)&\"/\"&MID($E1600,5,2)&\"/\"&RIGHT($E1600,2))","v":"//"},{"$f":"IF(OR($G1600=\"NTSI\",$G1600=\"TTSI\"),$F1600,LEFT($F1600,4)&\"/\"&MID($F1600,5,2)&\"/\"&RIGHT($F1600,2))","v":"//"}]
[0,null,null,null,null,null,"","//","//"]
[0,null,null,null,null,null,"","//","//"]
[0,null,null,null,null,null,"","//","//"]
[0,null,null,null,null,null,"","//","//"]
[{"$f":"IF(RIGHT(B1605,1)=\"H\",LEFT(B1605,11)&\"B\",B1605)","v":0},null,null,null,null,null,{"$f":"MID(C1605,4,4)","v":""},"//","//"]
[0,null,null,null,null,null,"","//","//"]
[0,null,null,null,null,null,"","//","//"]
[0,null,null,null,null,null,"","//","//"]
[0,null,null,null,null,null,"","//","//"]
[0,null,null,null,null,null,"","//","//"]
[0,null,null,null,null,null,"","//","//"]
[0,null,null,null,null,null,"","//","//"]
[0,null,null,null,null,null,"","//","//"]
[0,null,null,null,null,null,"","//","//"]
[0,null,null,null,null,null,"","//","//"]
[0,null,null,null,null,null,"","//","//"]
[0,null,null,null,null,null,"","//","//"]
[0,null,null,null,null,null,"","//","//"]
[0,null,null,null,null,null,"","//","//"]
[0,null,null,null,null,null,"","//","//"]
[0,null,null,null,null,null,"","//","//"]
[0,null,null,null,null,null,"","//","//"]
[0,null,null,null,null,null,"","//","//"]
[0,null,null,null,null,null,"","//","//"]
[0,null,null,null,null,null,"","//","//"]
[0,null,null,null,null,null,"","//","//"]
[0,null,null,null,null,null,"","//","//"]
[0,null,null,null,null,null,"","//","//"]
[0,null,null,null,null,null,"","//","//"]
[0,null,null,null,null,null,"","//","//"]
[0,null,null,null,null,null,"","//","//"]
[0,null,null,null,null,null,"","//","//"]
[0,null,null,null,null,null,"","//","//"]
[0,null,null,null,null,null,"","//","//"]
[0,null,null,null,null,null,"","//","//"]
[0,null,null,null,null,null,"","//","//"]
[0,null,null,null,null,null,"","//","//"]
[0,null,null,null,null,null,"","//","//"]
[0,null,null,null,null,null,"","//","//"]
[0,null,null,null,null,null,"","//","//"]
[0,null,null,null,null,null,"","//","//"]
[0,null,null,null,null,null,"","//","//"]
[0,null,null,null,null,null,"","//","//"]
[0,null,null,null,null,null,"","//","//"]
[0,null,null,null,null,null,"","//","//"]
[0,null,null,null,null,null,"","//","//"]
[0,null,null,null,null,null,"","//","//"]
[0,null,null,null,null,null,"","//","//"]
[0,null,null,null,null,null,"","//","//"]
[0,null,null,null,null,null,"","//","//"]
[0,null,null,null,null,null,"","//","//"]
[0,null,null,null,null,null,"","//","//"]
[0,null,null,null,null,null,"","//","//"]
[0,null,null,null,null,null,"","//","//"]
[0,null,null,null,null,null,"","//","//"]
[0,null,null,null,null,null,"","//","//"]
[0,null,null,null,null,null,"","//","//"]
[0,null,null,null,null,null,"","//","//"]
[0,null,null,null,null,null,"","//","//"]
[0,null,null,null,null,null,"","//","//"]
[0,null,null,null,null,null,"","//","//"]
[0,null,null,null,null,null,"","//","//"]
[0,null,null,null,null,null,"","//","//"]
[0,null,null,null,null,null,"",{"$f":"IF(OR($G1664=\"NTSI\",$G1664=\"TTSI\"),$E1664,LEFT($E1664,4)&\"/\"&MID($E1664,5,2)&\"/\"&RIGHT($E1664,2))","v":"//"},{"$f":"IF(OR($G1664=\"NTSI\",$G1664=\"TTSI\"),$F1664,LEFT($F1664,4)&\"/\"&MID($F1664,5,2)&\"/\"&RIGHT($F1664,2))","v":"//"}]
[0,null,null,null,null,null,"","//","//"]
[0,null,null,null,null,null,"","//","//"]
[0,null,null,null,null,null,"","//","//"]
[0,null,null,null,null,null,"","//","//"]
[{"$f":"IF(RIGHT(B1669,1)=\"H\",LEFT(B1669,11)&\"B\",B1669)","v":0},null,null,null,null,null,{"$f":"MID(C1669,4,4)","v":""},"//","//"]
[0,null,null,null,null,null,"","//","//"]
[0,null,null,null,null,null,"","//","//"]
[0,null,null,null,null,null,"","//","//"]
[0,null,null,null,null,null,"","//","//"]
[0,null,null,null,null,null,"","//","//"]
[0,null,null,null,null,null,"","//","//"]
[0,null,null,null,null,null,"","//","//"]
[0,null,null,null,null,null,"","//","//"]
[0,null,null,null,null,null,"","//","//"]
[0,null,null,null,null,null,"","//","//"]
[0,null,null,null,null,null,"","//","//"]
[0,null,null,null,null,null,"","//","//"]
[0,null,null,null,null,null,"","//","//"]
[0,null,null,null,null,null,"","//","//"]
[0,null,null,null,null,null,"","//","//"]
[0,null,null,null,null,null,"","//","//"]
[0,null,null,null,null,null,"","//","//"]
[0,null,null,null,null,null,"","//","//"]
[0,null,null,null,null,null,"","//","//"]
[0,null,null,null,null,null,"","//","//"]
[0,null,null,null,null,null,"","//","//"]
[0,null,null,null,null,null,"","//","//"]
[0,null,null,null,null,null,"","//","//"]
[0,null,null,null,null,null,"","//","//"]
[0,null,null,null,null,null,"","//","//"]
[0,null,null,null,null,null,"","//","//"]
[0,null,null,null,null,null,"","//","//"]
[0,null,null,null,null,null,"","//","//"]
[0,null,null,null,null,null,"","//","//"]
[0,null,null,null,null,null,"","//","//"]
[0,null,null,null,null,null,"","//","//"]
[0,null,null,null,null,null,"","//","//"]
[0,null,null,null,null,null,"","//","//"]
[0,null,null,null,null,null,"","//","//"]
[0,null,null,null,null,null,"","//","//"]
[0,null,null,null,null,null,"","//","//"]
[0,null,null,null,null,null,"","//","//"]
[0,null,null,null,null,null,"","//","//"]
[0,null,null,null,null,null,"","//","//"]
[0,null,null,null,null,null,"","//","//"]
[0,null,null,null,null,null,"","//","//"]
[0,null,null,null,null,null,"","//","//"]
[0,null,null,null,null,null,"","//","//"]
[0,null,null,null,null,null,"","//","//"]
[0,null,null,null,null,null,"","//","//"]
[0,null,null,null,null,null,"","//","//"]
[0,null,null,null,null,null,"","//","//"]
[0,null,null,null,null,null,"","//","//"]
[0,null,null,null,null,null,"","//","//"]
[0,null,null,null,null,null,"","//","//"]
[0,null,null,null,null,null,"","//","//"]
[0,null,null,null,null,null,"","//","//"]
[0,null,null,null,null,null,"","//","//"]
[0,null,null,null,null,null,"","//","//"]
[0,null,null,null,null,null,"","//","//"]
[0,null,null,null,null,null,"","//","//"]
[0,null,null,null,null,null,"","//","//"]
[0,null,null,null,null,null,"","//","//"]
[0,null,null,null,null,null,"",{"$f":"IF(OR($G1728=\"NTSI\",$G1728=\"TTSI\"),$E1728,LEFT($E1728,4)&\"/\"&MID($E1728,5,2)&\"/\"&RIGHT($E1728,2))","v":"//"},{"$f":"IF(OR($G1728=\"NTSI\",$G1728=\"TTSI\"),$F1728,LEFT($F1728,4)&\"/\"&MID($F1728,5,2)&\"/\"&RIGHT($F1728,2))","v":"//"}]
[0,null,null,null,null,null,"","//","//"]
[0,null,null,null,null,null,"","//","//"]
[0,null,null,null,null,null,"","//","//"]
[0,null,null,null,null,null,"","//","//"]
[{"$f":"IF(RIGHT(B1733,1)=\"H\",LEFT(B1733,11)&\"B\",B1733)","v":0},null,null,null,null,null,{"$f":"MID(C1733,4,4)","v":""},"//","//"]
[0,null,null,null,null,null,"","//","//"]
[0,null,null,null,null,null,"","//","//"]
[0,null,null,null,null,null,"","//","//"]
[0,null,null,null,null,null,"","//","//"]
[0,null,null,null,null,null,"","//","//"]
[0,null,null,null,null,null,"","//","//"]
[0,null,null,null,null,null,"","//","//"]
[0,null,null,null,null,null,"","//","//"]
[0,null,null,null,null,null,"","//","//"]
[0,null,null,null,null,null,"","//","//"]
[0,null,null,null,null,null,"","//","//"]
[0,null,null,null,null,null,"","//","//"]
[0,null,null,null,null,null,"","//","//"]
[0,null,null,null,null,null,"","//","//"]
[0,null,null,null,null,null,"","//","//"]
[0,null,null,null,null,null,"","//","//"]
[0,null,null,null,null,null,"","//","//"]
[0,null,null,null,null,null,"","//","//"]
[0,null,null,null,null,null,"","//","//"]
[0,null,null,null,null,null,"","//","//"]
[0,null,null,null,null,null,"","//","//"]
[0,null,null,null,null,null,"","//","//"]
[0,null,null,null,null,null,"","//","//"]
[0,null,null,null,null,null,"","//","//"]
[0,null,null,null,null,null,"","//","//"]
[0,null,null,null,null,null,"","//","//"]
[0,null,null,null,null,null,"","//","//"]
[0,null,null,null,null,null,"","//","//"]
[0,null,null,null,null,null,"","//","//"]
[0,null,null,null,null,null,"","//","//"]
[0,null,null,null,null,null,"","//","//"]
[0,null,null,null,null,null,"","//","//"]
[0,null,null,null,null,null,"","//","//"]
[0,null,null,null,null,null,"","//","//"]
[0,null,null,null,null,null,"","//","//"]
[0,null,null,null,null,null,"","//","//"]
[0,null,null,null,null,null,"","//","//"]
[0,null,null,null,null,null,"","//","//"]
[0,null,null,null,null,null,"","//","//"]
[0,null,null,null,null,null,"","//","//"]
[0,null,null,null,null,null,"","//","//"]
[0,null,null,null,null,null,"","//","//"]
[0,null,null,null,null,null,"","//","//"]
[0,null,null,null,null,null,"","//","//"]
[0,null,null,null,null,null,"","//","//"]
[0,null,null,null,null,null,"","//","//"]
[0,null,null,null,null,null,"","//","//"]
[0,null,null,null,null,null,"","//","//"]
[0,null,null,null,null,null,"","//","//"]
[0,null,null,null,null,null,"","//","//"]
[0,null,null,null,null,null,"","//","//"]
[0,null,null,null,null,null,"","//","//"]
[0,null,null,null,null,null,"","//","//"]
[0,null,null,null,null,null,"","//","//"]
[0,null,null,null,null,null,"","//","//"]
[0,null,null,null,null,null,"","//","//"]
[0,null,null,null,null,null,"","//","//"]
[0,null,null,null,null,null,"","//","//"]
[0,null,null,null,null,null,"",{"$f":"IF(OR($G1792=\"NTSI\",$G1792=\"TTSI\"),$E1792,LEFT($E1792,4)&\"/\"&MID($E1792,5,2)&\"/\"&RIGHT($E1792,2))","v":"//"},{"$f":"IF(OR($G1792=\"NTSI\",$G1792=\"TTSI\"),$F1792,LEFT($F1792,4)&\"/\"&MID($F1792,5,2)&\"/\"&RIGHT($F1792,2))","v":"//"}]
[0,null,null,null,null,null,"","//","//"]
[0,null,null,null,null,null,"","//","//"]
[0,null,null,null,null,null,"","//","//"]
[0,null,null,null,null,null,"","//","//"]
[{"$f":"IF(RIGHT(B1797,1)=\"H\",LEFT(B1797,11)&\"B\",B1797)","v":0},null,null,null,null,null,{"$f":"MID(C1797,4,4)","v":""},"//","//"]
[0,null,null,null,null,null,"","//","//"]
[0,null,null,null,null,null,"","//","//"]
[0,null,null,null,null,null,"","//","//"]
[0,null,null,null,null,null,"","//","//"]
[0,null,null,null,null,null,"","//","//"]
[0,null,null,null,null,null,"","//","//"]
[0,null,null,null,null,null,"","//","//"]
[0,null,null,null,null,null,"","//","//"]
[0,null,null,null,null,null,"","//","//"]
[0,null,null,null,null,null,"","//","//"]
[0,null,null,null,null,null,"","//","//"]
[0,null,null,null,null,null,"","//","//"]
[0,null,null,null,null,null,"","//","//"]
[0,null,null,null,null,null,"","//","//"]
[0,null,null,null,null,null,"","//","//"]
[0,null,null,null,null,null,"","//","//"]
[0,null,null,null,null,null,"","//","//"]
[0,null,null,null,null,null,"","//","//"]
[0,null,null,null,null,null,"","//","//"]
[0,null,null,null,null,null,"","//","//"]
[0,null,null,null,null,null,"","//","//"]
[0,null,null,null,null,null,"","//","//"]
[0,null,null,null,null,null,"","//","//"]
[0,null,null,null,null,null,"","//","//"]
[0,null,null,null,null,null,"","//","//"]
[0,null,null,null,null,null,"","//","//"]
[0,null,null,null,null,null,"","//","//"]
[0,null,null,null,null,null,"","//","//"]
[0,null,null,null,null,null,"","//","//"]
[0,null,null,null,null,null,"","//","//"]
[0,null,null,null,null,null,"","//","//"]
[0,null,null,null,null,null,"","//","//"]
[0,null,null,null,null,null,"","//","//"]
[0,null,null,null,null,null,"","//","//"]
[0,null,null,null,null,null,"","//","//"]
[0,null,null,null,null,null,"","//","//"]
[0,null,null,null,null,null,"","//","//"]
[0,null,null,null,null,null,"","//","//"]
[0,null,null,null,null,null,"","//","//"]
[0,null,null,null,null,null,"","//","//"]
[0,null,null,null,null,null,"","//","//"]
[0,null,null,null,null,null,"","//","//"]
[0,null,null,null,null,null,"","//","//"]
[0,null,null,null,null,null,"","//","//"]
[0,null,null,null,null,null,"","//","//"]
[0,null,null,null,null,null,"","//","//"]
[0,null,null,null,null,null,"","//","//"]
[0,null,null,null,null,null,"","//","//"]
[0,null,null,null,null,null,"","//","//"]
[0,null,null,null,null,null,"","//","//"]
[0,null,null,null,null,null,"","//","//"]
[0,null,null,null,null,null,"","//","//"]
[0,null,null,null,null,null,"","//","//"]
[0,null,null,null,null,null,"","//","//"]
[0,null,null,null,null,null,"","//","//"]
[0,null,null,null,null,null,"","//","//"]
[0,null,null,null,null,null,"","//","//"]
[0,null,null,null,null,null,"","//","//"]
[0,null,null,null,null,null,"",{"$f":"IF(OR($G1856=\"NTSI\",$G1856=\"TTSI\"),$E1856,LEFT($E1856,4)&\"/\"&MID($E1856,5,2)&\"/\"&RIGHT($E1856,2))","v":"//"},{"$f":"IF(OR($G1856=\"NTSI\",$G1856=\"TTSI\"),$F1856,LEFT($F1856,4)&\"/\"&MID($F1856,5,2)&\"/\"&RIGHT($F1856,2))","v":"//"}]
[0,null,null,null,null,null,"","//","//"]
[0,null,null,null,null,null,"","//","//"]
[0,null,null,null,null,null,"","//","//"]
[0,null,null,null,null,null,"","//","//"]
[{"$f":"IF(RIGHT(B1861,1)=\"H\",LEFT(B1861,11)&\"B\",B1861)","v":0},null,null,null,null,null,{"$f":"MID(C1861,4,4)","v":""},"//","//"]
[0,null,null,null,null,null,"","//","//"]
[0,null,null,null,null,null,"","//","//"]
[0,null,null,null,null,null,"","//","//"]
[0,null,null,null,null,null,"","//","//"]
[0,null,null,null,null,null,"","//","//"]
[0,null,null,null,null,null,"","//","//"]
[0,null,null,null,null,null,"","//","//"]
[0,null,null,null,null,null,"","//","//"]
[0,null,null,null,null,null,"","//","//"]
[0,null,null,null,null,null,"","//","//"]
[0,null,null,null,null,null,"","//","//"]
[0,null,null,null,null,null,"","//","//"]
[0,null,null,null,null,null,"","//","//"]
[0,null,null,null,null,null,"","//","//"]
[0,null,null,null,null,null,"","//","//"]
[0,null,null,null,null,null,"","//","//"]
[0,null,null,null,null,null,"","//","//"]
[0,null,null,null,null,null,"","//","//"]
[0,null,null,null,null,null,"","//","//"]
[0,null,null,null,null,null,"","//","//"]
[0,null,null,null,null,null,"","//","//"]
[0,null,null,null,null,null,"","//","//"]
[0,null,null,null,null,null,"","//","//"]
[0,null,null,null,null,null,"","//","//"]
[0,null,null,null,null,null,"","//","//"]
[0,null,null,null,null,null,"","//","//"]
[0,null,null,null,null,null,"","//","//"]
[0,null,null,null,null,null,"","//","//"]
[0,null,null,null,null,null,"","//","//"]
[0,null,null,null,null,null,"","//","//"]
[0,null,null,null,null,null,"","//","//"]
[0,null,null,null,null,null,"","//","//"]
[0,null,null,null,null,null,"","//","//"]
[0,null,null,null,null,null,"","//","//"]
[0,null,null,null,null,null,"","//","//"]
[0,null,null,null,null,null,"","//","//"]
[0,null,null,null,null,null,"","//","//"]
[0,null,null,null,null,null,"","//","//"]
[0,null,null,null,null,null,"","//","//"]
[0,null,null,null,null,null,"","//","//"]
[0,null,null,null,null,null,"","//","//"]
[0,null,null,null,null,null,"","//","//"]
[0,null,null,null,null,null,"","//","//"]
[0,null,null,null,null,null,"","//","//"]
[0,null,null,null,null,null,"","//","//"]
[0,null,null,null,null,null,"","//","//"]
[0,null,null,null,null,null,"","//","//"]
[0,null,null,null,null,null,"","//","//"]
[0,null,null,null,null,null,"","//","//"]
[0,null,null,null,null,null,"","//","//"]
[0,null,null,null,null,null,"","//","//"]
[0,null,null,null,null,null,"","//","//"]
[0,null,null,null,null,null,"","//","//"]
[0,null,null,null,null,null,"","//","//"]
[0,null,null,null,null,null,"","//","//"]
[0,null,null,null,null,null,"","//","//"]
[0,null,null,null,null,null,"","//","//"]
[0,null,null,null,null,null,"","//","//"]
[0,null,null,null,null,null,"",{"$f":"IF(OR($G1920=\"NTSI\",$G1920=\"TTSI\"),$E1920,LEFT($E1920,4)&\"/\"&MID($E1920,5,2)&\"/\"&RIGHT($E1920,2))","v":"//"},{"$f":"IF(OR($G1920=\"NTSI\",$G1920=\"TTSI\"),$F1920,LEFT($F1920,4)&\"/\"&MID($F1920,5,2)&\"/\"&RIGHT($F1920,2))","v":"//"}]
[0,null,null,null,null,null,"","//","//"]
[0,null,null,null,null,null,"","//","//"]
[0,null,null,null,null,null,"","//","//"]
[0,null,null,null,null,null,"","//","//"]
[{"$f":"IF(RIGHT(B1925,1)=\"H\",LEFT(B1925,11)&\"B\",B1925)","v":0},null,null,null,null,null,{"$f":"MID(C1925,4,4)","v":""},"//","//"]
[0,null,null,null,null,null,"","//","//"]
[0,null,null,null,null,null,"","//","//"]
[0,null,null,null,null,null,"","//","//"]
[0,null,null,null,null,null,"","//","//"]
[0,null,null,null,null,null,"","//","//"]
[0,null,null,null,null,null,"","//","//"]
[0,null,null,null,null,null,"","//","//"]
[0,null,null,null,null,null,"","//","//"]
[0,null,null,null,null,null,"","//","//"]
[0,null,null,null,null,null,"","//","//"]
[0,null,null,null,null,null,"","//","//"]
[0,null,null,null,null,null,"","//","//"]
[0,null,null,null,null,null,"","//","//"]
[0,null,null,null,null,null,"","//","//"]
[0,null,null,null,null,null,"","//","//"]
[0,null,null,null,null,null,"","//","//"]
[0,null,null,null,null,null,"","//","//"]
[0,null,null,null,null,null,"","//","//"]
[0,null,null,null,null,null,"","//","//"]
[0,null,null,null,null,null,"","//","//"]
[0,null,null,null,null,null,"","//","//"]
[0,null,null,null,null,null,"","//","//"]
[0,null,null,null,null,null,"","//","//"]
[0,null,null,null,null,null,"","//","//"]
[0,null,null,null,null,null,"","//","//"]
[0,null,null,null,null,null,"","//","//"]
[0,null,null,null,null,null,"","//","//"]
[0,null,null,null,null,null,"","//","//"]
[0,null,null,null,null,null,"","//","//"]
[0,null,null,null,null,null,"","//","//"]
[0,null,null,null,null,null,"","//","//"]
[0,null,null,null,null,null,"","//","//"]
[0,null,null,null,null,null,"","//","//"]
[0,null,null,null,null,null,"","//","//"]
[0,null,null,null,null,null,"","//","//"]
[0,null,null,null,null,null,"","//","//"]
[0,null,null,null,null,null,"","//","//"]
[0,null,null,null,null,null,"","//","//"]
[0,null,null,null,null,null,"","//","//"]
[0,null,null,null,null,null,"","//","//"]
[0,null,null,null,null,null,"","//","//"]
[0,null,null,null,null,null,"","//","//"]
[0,null,null,null,null,null,"","//","//"]
[0,null,null,null,null,null,"","//","//"]
[0,null,null,null,null,null,"","//","//"]
[0,null,null,null,null,null,"","//","//"]
[0,null,null,null,null,null,"","//","//"]
[0,null,null,null,null,null,"","//","//"]
[0,null,null,null,null,null,"","//","//"]
[0,null,null,null,null,null,"","//","//"]
[0,null,null,null,null,null,"","//","//"]
[0,null,null,null,null,null,"","//","//"]
[0,null,null,null,null,null,"","//","//"]
[0,null,null,null,null,null,"","//","//"]
[0,null,null,null,null,null,"","//","//"]
[0,null,null,null,null,null,"","//","//"]
[0,null,null,null,null,null,"","//","//"]
[0,null,null,null,null,null,"","//","//"]
[0,null,null,null,null,null,"",{"$f":"IF(OR($G1984=\"NTSI\",$G1984=\"TTSI\"),$E1984,LEFT($E1984,4)&\"/\"&MID($E1984,5,2)&\"/\"&RIGHT($E1984,2))","v":"//"},{"$f":"IF(OR($G1984=\"NTSI\",$G1984=\"TTSI\"),$F1984,LEFT($F1984,4)&\"/\"&MID($F1984,5,2)&\"/\"&RIGHT($F1984,2))","v":"//"}]
[0,null,null,null,null,null,"","//","//"]
[0,null,null,null,null,null,"","//","//"]
[0,null,null,null,null,null,"","//","//"]
[0,null,null,null,null,null,"","//","//"]
[{"$f":"IF(RIGHT(B1989,1)=\"H\",LEFT(B1989,11)&\"B\",B1989)","v":0},null,null,null,null,null,{"$f":"MID(C1989,4,4)","v":""},"//","//"]
[0,null,null,null,null,null,"","//","//"]
[0,null,null,null,null,null,"","//","//"]
[0,null,null,null,null,null,"","//","//"]
[0,null,null,null,null,null,"","//","//"]
[0,null,null,null,null,null,"","//","//"]
[0,null,null,null,null,null,"","//","//"]
[0,null,null,null,null,null,"","//","//"]
[0,null,null,null,null,null,"","//","//"]
[0,null,null,null,null,null,"","//","//"]
[0,null,null,null,null,null,"","//","//"]
[0,null,null,null,null,null,"","//","//"]
[0,null,null,null,null,null,"","//","//"]
[0,null,null,null,null,null,"","//","//"]
[0,null,null,null,null,null,"","//","//"]
[0,null,null,null,null,null,"","//","//"]
[0,null,null,null,null,null,"","//","//"]
[0,null,null,null,null,null,"","//","//"]
[0,null,null,null,null,null,"","//","//"]
[0,null,null,null,null,null,"","//","//"]
[0,null,null,null,null,null,"","//","//"]
[0,null,null,null,null,null,"","//","//"]
[0,null,null,null,null,null,"","//","//"]
[0,null,null,null,null,null,"","//","//"]
[0,null,null,null,null,null,"","//","//"]
[0,null,null,null,null,null,"","//","//"]
[0,null,null,null,null,null,"","//","//"]
[0,null,null,null,null,null,"","//","//"]
[0,null,null,null,null,null,"","//","//"]
[0,null,null,null,null,null,"","//","//"]
[0,null,null,null,null,null,"","//","//"]
[0,null,null,null,null,null,"","//","//"]
[0,null,null,null,null,null,"","//","//"]
[0,null,null,null,null,null,"","//","//"]
[0,null,null,null,null,null,"","//","//"]
[0,null,null,null,null,null,"","//","//"]
[0,null,null,null,null,null,"","//","//"]
[0,null,null,null,null,null,"","//","//"]
[0,null,null,null,null,null,"","//","//"]
[0,null,null,null,null,null,"","//","//"]
[0,null,null,null,null,null,"","//","//"]
[0,null,null,null,null,null,"","//","//"]
[0,null,null,null,null,null,"","//","//"]
[0,null,null,null,null,null,"","//","//"]
[0,null,null,null,null,null,"","//","//"]
[0,null,null,null,null,null,"","//","//"]
[0,null,null,null,null,null,"","//","//"]
[0,null,null,null,null,null,"","//","//"]
[0,null,null,null,null,null,"","//","//"]
[0,null,null,null,null,null,"","//","//"]
[0,null,null,null,null,null,"","//","//"]
[0,null,null,null,null,null,"","//","//"]
[0,null,null,null,null,null,"","//","//"]
[0,null,null,null,null,null,"","//","//"]
[0,null,null,null,null,null,"","//","//"]
[0,null,null,null,null,null,"","//","//"]
[0,null,null,null,null,null,"","//","//"]
[0,null,null,null,null,null,"","//","//"]
[0,null,null,null,null,null,"","//","//"]
[0,null,null,null,null,null,"",{"$f":"IF(OR($G2048=\"NTSI\",$G2048=\"TTSI\"),$E2048,LEFT($E2048,4)&\"/\"&MID($E2048,5,2)&\"/\"&RIGHT($E2048,2))","v":"//"},{"$f":"IF(OR($G2048=\"NTSI\",$G2048=\"TTSI\"),$F2048,LEFT($F2048,4)&\"/\"&MID($F2048,5,2)&\"/\"&RIGHT($F2048,2))","v":"//"}]
[0,null,null,null,null,null,"","//","//"]
[0,null,null,null,null,null,"","//","//"]
[0,null,null,null,null,null,"","//","//"]
[0,null,null,null,null,null,"","//","//"]
[{"$f":"IF(RIGHT(B2053,1)=\"H\",LEFT(B2053,11)&\"B\",B2053)","v":0},null,null,null,null,null,{"$f":"MID(C2053,4,4)","v":""},"//","//"]
[0,null,null,null,null,null,"","//","//"]
[0,null,null,null,null,null,"","//","//"]
[0,null,null,null,null,null,"","//","//"]
[0,null,null,null,null,null,"","//","//"]
[0,null,null,null,null,null,"","//","//"]
[0,null,null,null,null,null,"","//","//"]
[0,null,null,null,null,null,"","//","//"]
[0,null,null,null,null,null,"","//","//"]
[0,null,null,null,null,null,"","//","//"]
[0,null,null,null,null,null,"","//","//"]
[0,null,null,null,null,null,"","//","//"]
[0,null,null,null,null,null,"","//","//"]
[0,null,null,null,null,null,"","//","//"]
[0,null,null,null,null,null,"","//","//"]
[0,null,null,null,null,null,"","//","//"]
[0,null,null,null,null,null,"","//","//"]
[0,null,null,null,null,null,"","//","//"]
[0,null,null,null,null,null,"","//","//"]
[0,null,null,null,null,null,"","//","//"]
[0,null,null,null,null,null,"","//","//"]
[0,null,null,null,null,null,"","//","//"]
[0,null,null,null,null,null,"","//","//"]
[0,null,null,null,null,null,"","//","//"]
[0,null,null,null,null,null,"","//","//"]
[0,null,null,null,null,null,"","//","//"]
[0,null,null,null,null,null,"","//","//"]
[0,null,null,null,null,null,"","//","//"]
[0,null,null,null,null,null,"","//","//"]
[0,null,null,null,null,null,"","//","//"]
[0,null,null,null,null,null,"","//","//"]
[0,null,null,null,null,null,"","//","//"]
[0,null,null,null,null,null,"","//","//"]
[0,null,null,null,null,null,"","//","//"]
[0,null,null,null,null,null,"","//","//"]
[0,null,null,null,null,null,"","//","//"]
[0,null,null,null,null,null,"","//","//"]
[0,null,null,null,null,null,"","//","//"]
[0,null,null,null,null,null,"","//","//"]
[0,null,null,null,null,null,"","//","//"]
[0,null,null,null,null,null,"","//","//"]
[0,null,null,null,null,null,"","//","//"]
[0,null,null,null,null,null,"","//","//"]
[0,null,null,null,null,null,"","//","//"]
[0,null,null,null,null,null,"","//","//"]
[0,null,null,null,null,null,"","//","//"]
[0,null,null,null,null,null,"","//","//"]
[0,null,null,null,null,null,"","//","//"]
[0,null,null,null,null,null,"","//","//"]
[0,null,null,null,null,null,"","//","//"]
[0,null,null,null,null,null,"","//","//"]
[0,null,null,null,null,null,"","//","//"]
[0,null,null,null,null,null,"","//","//"]
[0,null,null,null,null,null,"","//","//"]
[0,null,null,null,null,null,"","//","//"]
[0,null,null,null,null,null,"","//","//"]
[0,null,null,null,null,null,"","//","//"]
[0,null,null,null,null,null,"","//","//"]
[0,null,null,null,null,null,"","//","//"]
[0,null,null,null,null,null,"",{"$f":"IF(OR($G2112=\"NTSI\",$G2112=\"TTSI\"),$E2112,LEFT($E2112,4)&\"/\"&MID($E2112,5,2)&\"/\"&RIGHT($E2112,2))","v":"//"},{"$f":"IF(OR($G2112=\"NTSI\",$G2112=\"TTSI\"),$F2112,LEFT($F2112,4)&\"/\"&MID($F2112,5,2)&\"/\"&RIGHT($F2112,2))","v":"//"}]
[0,null,null,null,null,null,"","//","//"]
[0,null,null,null,null,null,"","//","//"]
[0,null,null,null,null,null,"","//","//"]
[0,null,null,null,null,null,"","//","//"]
[{"$f":"IF(RIGHT(B2117,1)=\"H\",LEFT(B2117,11)&\"B\",B2117)","v":0},null,null,null,null,null,{"$f":"MID(C2117,4,4)","v":""},"//","//"]
[0,null,null,null,null,null,"","//","//"]
[0,null,null,null,null,null,"","//","//"]
[0,null,null,null,null,null,"","//","//"]
[0,null,null,null,null,null,"","//","//"]
[0,null,null,null,null,null,"","//","//"]
[0,null,null,null,null,null,"","//","//"]
[0,null,null,null,null,null,"","//","//"]
[0,null,null,null,null,null,"","//","//"]
[0,null,null,null,null,null,"","//","//"]
[0,null,null,null,null,null,"","//","//"]
[0,null,null,null,null,null,"","//","//"]
[0,null,null,null,null,null,"","//","//"]
[0,null,null,null,null,null,"","//","//"]
[0,null,null,null,null,null,"","//","//"]
[0,null,null,null,null,null,"","//","//"]
[0,null,null,null,null,null,"","//","//"]
[0,null,null,null,null,null,"","//","//"]
[0,null,null,null,null,null,"","//","//"]
[0,null,null,null,null,null,"","//","//"]
[0,null,null,null,null,null,"","//","//"]
[0,null,null,null,null,null,"","//","//"]
[0,null,null,null,null,null,"","//","//"]
[0,null,null,null,null,null,"","//","//"]
[0,null,null,null,null,null,"","//","//"]
[0,null,null,null,null,null,"","//","//"]
[0,null,null,null,null,null,"","//","//"]
[0,null,null,null,null,null,"","//","//"]
[0,null,null,null,null,null,"","//","//"]
[0,null,null,null,null,null,"","//","//"]
[0,null,null,null,null,null,"","//","//"]
[0,null,null,null,null,null,"","//","//"]
[0,null,null,null,null,null,"","//","//"]
[0,null,null,null,null,null,"","//","//"]
[0,null,null,null,null,null,"","//","//"]
[0,null,null,null,null,null,"","//","//"]
[0,null,null,null,null,null,"","//","//"]
[0,null,null,null,null,null,"","//","//"]
[0,null,null,null,null,null,"","//","//"]
[0,null,null,null,null,null,"","//","//"]
[0,null,null,null,null,null,"","//","//"]
[0,null,null,null,null,null,"","//","//"]
[0,null,null,null,null,null,"","//","//"]
[0,null,null,null,null,null,"","//","//"]
[0,null,null,null,null,null,"","//","//"]
[0,null,null,null,null,null,"","//","//"]
[0,null,null,null,null,null,"","//","//"]
[0,null,null,null,null,null,"","//","//"]
[0,null,null,null,null,null,"","//","//"]
[0,null,null,null,null,null,"","//","//"]
[0,null,null,null,null,null,"","//","//"]
[0,null,null,null,null,null,"","//","//"]
[0,null,null,null,null,null,"","//","//"]
[0,null,null,null,null,null,"","//","//"]
[0,null,null,null,null,null,"","//","//"]
[0,null,null,null,null,null,"","//","//"]
[0,null,null,null,null,null,"","//","//"]
[0,null,null,null,null,null,"","//","//"]
[0,null,null,null,null,null,"","//","//"]
[0,null,null,null,null,null,"",{"$f":"IF(OR($G2176=\"NTSI\",$G2176=\"TTSI\"),$E2176,LEFT($E2176,4)&\"/\"&MID($E2176,5,2)&\"/\"&RIGHT($E2176,2))","v":"//"},{"$f":"IF(OR($G2176=\"NTSI\",$G2176=\"TTSI\"),$F2176,LEFT($F2176,4)&\"/\"&MID($F2176,5,2)&\"/\"&RIGHT($F2176,2))","v":"//"}]
[0,null,null,null,null,null,"","//","//"]
[0,null,null,null,null,null,"","//","//"]
[0,null,null,null,null,null,"","//","//"]
[0,null,null,null,null,null,"","//","//"]
[{"$f":"IF(RIGHT(B2181,1)=\"H\",LEFT(B2181,11)&\"B\",B2181)","v":0},null,null,null,null,null,{"$f":"MID(C2181,4,4)","v":""},"//","//"]
[0,null,null,null,null,null,"","//","//"]
[0,null,null,null,null,null,"","//","//"]
[0,null,null,null,null,null,"","//","//"]
[0,null,null,null,null,null,"","//","//"]
[0,null,null,null,null,null,"","//","//"]
[0,null,null,null,null,null,"","//","//"]
[0,null,null,null,null,null,"","//","//"]
[0,null,null,null,null,null,"","//","//"]
[0,null,null,null,null,null,"","//","//"]
[0,null,null,null,null,null,"","//","//"]
[0,null,null,null,null,null,"","//","//"]
[0,null,null,null,null,null,"","//","//"]
[0,null,null,null,null,null,"","//","//"]
[0,null,null,null,null,null,"","//","//"]
[0,null,null,null,null,null,"","//","//"]
[0,null,null,null,null,null,"","//","//"]
[0,null,null,null,null,null,"","//","//"]
[0,null,null,null,null,null,"","//","//"]
[0,null,null,null,null,null,"","//","//"]
[0,null,null,null,null,null,"","//","//"]
[0,null,null,null,null,null,"","//","//"]
[0,null,null,null,null,null,"","//","//"]
[0,null,null,null,null,null,"","//","//"]
[0,null,null,null,null,null,"","//","//"]
[0,null,null,null,null,null,"","//","//"]
[0,null,null,null,null,null,"","//","//"]
[0,null,null,null,null,null,"","//","//"]
[0,null,null,null,null,null,"","//","//"]
[0,null,null,null,null,null,"","//","//"]
[0,null,null,null,null,null,"","//","//"]
[0,null,null,null,null,null,"","//","//"]
[0,null,null,null,null,null,"","//","//"]
[0,null,null,null,null,null,"","//","//"]
[0,null,null,null,null,null,"","//","//"]
[0,null,null,null,null,null,"","//","//"]
[0,null,null,null,null,null,"","//","//"]
[0,null,null,null,null,null,"","//","//"]
[0,null,null,null,null,null,"","//","//"]
[0,null,null,null,null,null,"","//","//"]
[0,null,null,null,null,null,"","//","//"]
[0,null,null,null,null,null,"","//","//"]
[0,null,null,null,null,null,"","//","//"]
[0,null,null,null,null,null,"","//","//"]
[0,null,null,null,null,null,"","//","//"]
[0,null,null,null,null,null,"","//","//"]
[0,null,null,null,null,null,"","//","//"]
[0,null,null,null,null,null,"","//","//"]
[0,null,null,null,null,null,"","//","//"]
[0,null,null,null,null,null,"","//","//"]
[0,null,null,null,null,null,"","//","//"]
[0,null,null,null,null,null,"","//","//"]
[0,null,null,null,null,null,"","//","//"]
[0,null,null,null,null,null,"","//","//"]
[0,null,null,null,null,null,"","//","//"]
[0,null,null,null,null,null,"","//","//"]
[0,null,null,null,null,null,"","//","//"]
[0,null,null,null,null,null,"","//","//"]
[0,null,null,null,null,null,"","//","//"]
[0,null,null,null,null,null,"",{"$f":"IF(OR($G2240=\"NTSI\",$G2240=\"TTSI\"),$E2240,LEFT($E2240,4)&\"/\"&MID($E2240,5,2)&\"/\"&RIGHT($E2240,2))","v":"//"},{"$f":"IF(OR($G2240=\"NTSI\",$G2240=\"TTSI\"),$F2240,LEFT($F2240,4)&\"/\"&MID($F2240,5,2)&\"/\"&RIGHT($F2240,2))","v":"//"}]
[0,null,null,null,null,null,"","//","//"]
[0,null,null,null,null,null,"","//","//"]
[0,null,null,null,null,null,"","//","//"]
[0,null,null,null,null,null,"","//","//"]
[{"$f":"IF(RIGHT(B2245,1)=\"H\",LEFT(B2245,11)&\"B\",B2245)","v":0},null,null,null,null,null,{"$f":"MID(C2245,4,4)","v":""},"//","//"]
[0,null,null,null,null,null,"","//","//"]
[0,null,null,null,null,null,"","//","//"]
[0,null,null,null,null,null,"","//","//"]
[0,null,null,null,null,null,"","//","//"]
[0,null,null,null,null,null,"","//","//"]
[0,null,null,null,null,null,"","//","//"]
[0,null,null,null,null,null,"","//","//"]
[0,null,null,null,null,null,"","//","//"]
[0,null,null,null,null,null,"","//","//"]
[0,null,null,null,null,null,"","//","//"]
[0,null,null,null,null,null,"","//","//"]
[0,null,null,null,null,null,"","//","//"]
[0,null,null,null,null,null,"","//","//"]
[0,null,null,null,null,null,"","//","//"]
[0,null,null,null,null,null,"","//","//"]
[0,null,null,null,null,null,"","//","//"]
[0,null,null,null,null,null,"","//","//"]
[0,null,null,null,null,null,"","//","//"]
[0,null,null,null,null,null,"","//","//"]
[0,null,null,null,null,null,"","//","//"]
[0,null,null,null,null,null,"","//","//"]
[0,null,null,null,null,null,"","//","//"]
[0,null,null,null,null,null,"","//","//"]
[0,null,null,null,null,null,"","//","//"]
[0,null,null,null,null,null,"","//","//"]
[0,null,null,null,null,null,"","//","//"]
[0,null,null,null,null,null,"","//","//"]
[0,null,null,null,null,null,"","//","//"]
[0,null,null,null,null,null,"","//","//"]
[0,null,null,null,null,null,"","//","//"]
[0,null,null,null,null,null,"","//","//"]
[0,null,null,null,null,null,"","//","//"]
[0,null,null,null,null,null,"","//","//"]
[0,null,null,null,null,null,"","//","//"]
[0,null,null,null,null,null,"","//","//"]
[0,null,null,null,null,null,"","//","//"]
[0,null,null,null,null,null,"","//","//"]
[0,null,null,null,null,null,"","//","//"]
[0,null,null,null,null,null,"","//","//"]
[0,null,null,null,null,null,"","//","//"]
[0,null,null,null,null,null,"","//","//"]
[0,null,null,null,null,null,"","//","//"]
[0,null,null,null,null,null,"","//","//"]
[0,null,null,null,null,null,"","//","//"]
[0,null,null,null,null,null,"","//","//"]
[0,null,null,null,null,null,"","//","//"]
[0,null,null,null,null,null,"","//","//"]
[0,null,null,null,null,null,"","//","//"]
[0,null,null,null,null,null,"","//","//"]
[0,null,null,null,null,null,"","//","//"]
[0,null,null,null,null,null,"","//","//"]
[0,null,null,null,null,null,"","//","//"]
[0,null,null,null,null,null,"","//","//"]
[0,null,null,null,null,null,"","//","//"]
[0,null,null,null,null,null,"","//","//"]
[0,null,null,null,null,null,"","//","//"]
[0,null,null,null,null,null,"","//","//"]
[0,null,null,null,null,null,"","//","//"]
[0,null,null,null,null,null,"",{"$f":"IF(OR($G2304=\"NTSI\",$G2304=\"TTSI\"),$E2304,LEFT($E2304,4)&\"/\"&MID($E2304,5,2)&\"/\"&RIGHT($E2304,2))","v":"//"},{"$f":"IF(OR($G2304=\"NTSI\",$G2304=\"TTSI\"),$F2304,LEFT($F2304,4)&\"/\"&MID($F2304,5,2)&\"/\"&RIGHT($F2304,2))","v":"//"}]
[0,null,null,null,null,null,"","//","//"]
[0,null,null,null,null,null,"","//","//"]
[0,null,null,null,null,null,"","//","//"]
[0,null,null,null,null,null,"","//","//"]
[{"$f":"IF(RIGHT(B2309,1)=\"H\",LEFT(B2309,11)&\"B\",B2309)","v":0},null,null,null,null,null,{"$f":"MID(C2309,4,4)","v":""},"//","//"]
[0,null,null,null,null,null,"","//","//"]
[0,null,null,null,null,null,"","//","//"]
[0,null,null,null,null,null,"","//","//"]
[0,null,null,null,null,null,"","//","//"]
[0,null,null,null,null,null,"","//","//"]
[0,null,null,null,null,null,"","//","//"]
[0,null,null,null,null,null,"","//","//"]
[0,null,null,null,null,null,"","//","//"]
[0,null,null,null,null,null,"","//","//"]
[0,null,null,null,null,null,"","//","//"]
[0,null,null,null,null,null,"","//","//"]
[0,null,null,null,null,null,"","//","//"]
[0,null,null,null,null,null,"","//","//"]
[0,null,null,null,null,null,"","//","//"]
[0,null,null,null,null,null,"","//","//"]
[0,null,null,null,null,null,"","//","//"]
[0,null,null,null,null,null,"","//","//"]
[0,null,null,null,null,null,"","//","//"]
[0,null,null,null,null,null,"","//","//"]
[0,null,null,null,null,null,"","//","//"]
[0,null,null,null,null,null,"","//","//"]
[0,null,null,null,null,null,"","//","//"]
[0,null,null,null,null,null,"","//","//"]
[0,null,null,null,null,null,"","//","//"]
[0,null,null,null,null,null,"","//","//"]
[0,null,null,null,null,null,"","//","//"]
[0,null,null,null,null,null,"","//","//"]
[0,null,null,null,null,null,"","//","//"]
[0,null,null,null,null,null,"","//","//"]
[0,null,null,null,null,null,"","//","//"]
[0,null,null,null,null,null,"","//","//"]
[0,null,null,null,null,null,"","//","//"]
[0,null,null,null,null,null,"","//","//"]
[0,null,null,null,null,null,"","//","//"]
[0,null,null,null,null,null,"","//","//"]
[0,null,null,null,null,null,"","//","//"]
[0,null,null,null,null,null,"","//","//"]
[0,null,null,null,null,null,"","//","//"]
[0,null,null,null,null,null,"","//","//"]
[0,null,null,null,null,null,"","//","//"]
[0,null,null,null,null,null,"","//","//"]
[0,null,null,null,null,null,"","//","//"]
[0,null,null,null,null,null,"","//","//"]
[0,null,null,null,null,null,"","//","//"]
[0,null,null,null,null,null,"","//","//"]
[0,null,null,null,null,null,"","//","//"]
[0,null,null,null,null,null,"","//","//"]
[0,null,null,null,null,null,"","//","//"]
[0,null,null,null,null,null,"","//","//"]
[0,null,null,null,null,null,"","//","//"]
[0,null,null,null,null,null,"","//","//"]
[0,null,null,null,null,null,"","//","//"]
[0,null,null,null,null,null,"","//","//"]
[0,null,null,null,null,null,"","//","//"]
[0,null,null,null,null,null,"","//","//"]
[0,null,null,null,null,null,"","//","//"]
[0,null,null,null,null,null,"","//","//"]
[0,null,null,null,null,null,"","//","//"]
[0,null,null,null,null,null,"",{"$f":"IF(OR($G2368=\"NTSI\",$G2368=\"TTSI\"),$E2368,LEFT($E2368,4)&\"/\"&MID($E2368,5,2)&\"/\"&RIGHT($E2368,2))","v":"//"},{"$f":"IF(OR($G2368=\"NTSI\",$G2368=\"TTSI\"),$F2368,LEFT($F2368,4)&\"/\"&MID($F2368,5,2)&\"/\"&RIGHT($F2368,2))","v":"//"}]
[0,null,null,null,null,null,"","//","//"]
[0,null,null,null,null,null,"","//","//"]
[0,null,null,null,null,null,"","//","//"]
[0,null,null,null,null,null,"","//","//"]
[{"$f":"IF(RIGHT(B2373,1)=\"H\",LEFT(B2373,11)&\"B\",B2373)","v":0},null,null,null,null,null,{"$f":"MID(C2373,4,4)","v":""},"//","//"]
[0,null,null,null,null,null,"","//","//"]
[0,null,null,null,null,null,"","//","//"]
[0,null,null,null,null,null,"","//","//"]
[0,null,null,null,null,null,"","//","//"]
[0,null,null,null,null,null,"","//","//"]
[0,null,null,null,null,null,"","//","//"]
[0,null,null,null,null,null,"","//","//"]
[0,null,null,null,null,null,"","//","//"]
[0,null,null,null,null,null,"","//","//"]
[0,null,null,null,null,null,"","//","//"]
[0,null,null,null,null,null,"","//","//"]
[0,null,null,null,null,null,"","//","//"]
[0,null,null,null,null,null,"","//","//"]
[0,null,null,null,null,null,"","//","//"]
[0,null,null,null,null,null,"","//","//"]
[0,null,null,null,null,null,"","//","//"]
[0,null,null,null,null,null,"","//","//"]
[0,null,null,null,null,null,"","//","//"]
[0,null,null,null,null,null,"","//","//"]
[0,null,null,null,null,null,"","//","//"]
[0,null,null,null,null,null,"","//","//"]
[0,null,null,null,null,null,"","//","//"]
[0,null,null,null,null,null,"","//","//"]
[0,null,null,null,null,null,"","//","//"]
[0,null,null,null,null,null,"","//","//"]
[0,null,null,null,null,null,"","//","//"]
[0,null,null,null,null,null,"","//","//"]
[0,null,null,null,null,null,"","//","//"]
[0,null,null,null,null,null,"","//","//"]
[0,null,null,null,null,null,"","//","//"]
[0,null,null,null,null,null,"","//","//"]
[0,null,null,null,null,null,"","//","//"]
[0,null,null,null,null,null,"","//","//"]
[0,null,null,null,null,null,"","//","//"]
[0,null,null,null,null,null,"","//","//"]
[0,null,null,null,null,null,"","//","//"]
[0,null,null,null,null,null,"","//","//"]
[0,null,null,null,null,null,"","//","//"]
[0,null,null,null,null,null,"","//","//"]
[0,null,null,null,null,null,"","//","//"]
[0,null,null,null,null,null,"","//","//"]
[0,null,null,null,null,null,"","//","//"]
[0,null,null,null,null,null,"","//","//"]
[0,null,null,null,null,null,"","//","//"]
[0,null,null,null,null,null,"","//","//"]
[0,null,null,null,null,null,"","//","//"]
[0,null,null,null,null,null,"","//","//"]
[0,null,null,null,null,null,"","//","//"]
[0,null,null,null,null,null,"","//","//"]
[0,null,null,null,null,null,"","//","//"]
[0,null,null,null,null,null,"","//","//"]
[0,null,null,null,null,null,"","//","//"]
[0,null,null,null,null,null,"","//","//"]
[0,null,null,null,null,null,"","//","//"]
[0,null,null,null,null,null,"","//","//"]
[0,null,null,null,null,null,"","//","//"]
[0,null,null,null,null,null,"","//","//"]
[0,null,null,null,null,null,"","//","//"]
[0,null,null,null,null,null,"",{"$f":"IF(OR($G2432=\"NTSI\",$G2432=\"TTSI\"),$E2432,LEFT($E2432,4)&\"/\"&MID($E2432,5,2)&\"/\"&RIGHT($E2432,2))","v":"//"},{"$f":"IF(OR($G2432=\"NTSI\",$G2432=\"TTSI\"),$F2432,LEFT($F2432,4)&\"/\"&MID($F2432,5,2)&\"/\"&RIGHT($F2432,2))","v":"//"}]
[0,null,null,null,null,null,"","//","//"]
[0,null,null,null,null,null,"","//","//"]
[0,null,null,null,null,null,"","//","//"]
[0,null,null,null,null,null,"","//","//"]
[{"$f":"IF(RIGHT(B2437,1)=\"H\",LEFT(B2437,11)&\"B\",B2437)","v":0},null,null,null,null,null,{"$f":"MID(C2437,4,4)","v":""},"//","//"]
[0,null,null,null,null,null,"","//","//"]
[0,null,null,null,null,null,"","//","//"]
[0,null,null,null,null,null,"","//","//"]
[0,null,null,null,null,null,"","//","//"]
[0,null,null,null,null,null,"","//","//"]
[0,null,null,null,null,null,"","//","//"]
[0,null,null,null,null,null,"","//","//"]
[0,null,null,null,null,null,"","//","//"]
[0,null,null,null,null,null,"","//","//"]
[0,null,null,null,null,null,"","//","//"]
[0,null,null,null,null,null,"","//","//"]
[0,null,null,null,null,null,"","//","//"]
[0,null,null,null,null,null,"","//","//"]
[0,null,null,null,null,null,"","//","//"]
[0,null,null,null,null,null,"","//","//"]
[0,null,null,null,null,null,"","//","//"]
[0,null,null,null,null,null,"","//","//"]
[0,null,null,null,null,null,"","//","//"]
[0,null,null,null,null,null,"","//","//"]
[0,null,null,null,null,null,"","//","//"]
[0,null,null,null,null,null,"","//","//"]
[0,null,null,null,null,null,"","//","//"]
[0,null,null,null,null,null,"","//","//"]
[0,null,null,null,null,null,"","//","//"]
[0,null,null,null,null,null,"","//","//"]
[0,null,null,null,null,null,"","//","//"]
[0,null,null,null,null,null,"","//","//"]
[0,null,null,null,null,null,"","//","//"]
[0,null,null,null,null,null,"","//","//"]
[0,null,null,null,null,null,"","//","//"]
[0,null,null,null,null,null,"","//","//"]
[0,null,null,null,null,null,"","//","//"]
[0,null,null,null,null,null,"","//","//"]
[0,null,null,null,null,null,"","//","//"]
[0,null,null,null,null,null,"","//","//"]
[0,null,null,null,null,null,"","//","//"]
[0,null,null,null,null,null,"","//","//"]
[0,null,null,null,null,null,"","//","//"]
[0,null,null,null,null,null,"","//","//"]
[0,null,null,null,null,null,"","//","//"]
[0,null,null,null,null,null,"","//","//"]
[0,null,null,null,null,null,"","//","//"]
[0,null,null,null,null,null,"","//","//"]
[0,null,null,null,null,null,"","//","//"]
[0,null,null,null,null,null,"","//","//"]
[0,null,null,null,null,null,"","//","//"]
[0,null,null,null,null,null,"","//","//"]
[0,null,null,null,null,null,"","//","//"]
[0,null,null,null,null,null,"","//","//"]
[0,null,null,null,null,null,"","//","//"]
[0,null,null,null,null,null,"","//","//"]
[0,null,null,null,null,null,"","//","//"]
[0,null,null,null,null,null,"","//","//"]
[0,null,null,null,null,null,"","//","//"]
[0,null,null,null,null,null,"","//","//"]
[0,null,null,null,null,null,"","//","//"]
[0,null,null,null,null,null,"","//","//"]
[0,null,null,null,null,null,"","//","//"]
[0,null,null,null,null,null,"",{"$f":"IF(OR($G2496=\"NTSI\",$G2496=\"TTSI\"),$E2496,LEFT($E2496,4)&\"/\"&MID($E2496,5,2)&\"/\"&RIGHT($E2496,2))","v":"//"},{"$f":"IF(OR($G2496=\"NTSI\",$G2496=\"TTSI\"),$F2496,LEFT($F2496,4)&\"/\"&MID($F2496,5,2)&\"/\"&RIGHT($F2496,2))","v":"//"}]
[0,null,null,null,null,null,"","//","//"]
[0,null,null,null,null,null,"","//","//"]
[0,null,null,null,null,null,"","//","//"]
[0,null,null,null,null,null,"","//","//"]
[{"$f":"IF(RIGHT(B2501,1)=\"H\",LEFT(B2501,11)&\"B\",B2501)","v":0},null,null,null,null,null,{"$f":"MID(C2501,4,4)","v":""},"//","//"]
[0,null,null,null,null,null,"","//","//"]
[0,null,null,null,null,null,"","//","//"]
[0,null,null,null,null,null,"","//","//"]
[0,null,null,null,null,null,"","//","//"]
[0,null,null,null,null,null,"","//","//"]
[0,null,null,null,null,null,"","//","//"]
[0,null,null,null,null,null,"","//","//"]
[0,null,null,null,null,null,"","//","//"]
[0,null,null,null,null,null,"","//","//"]
[0,null,null,null,null,null,"","//","//"]
[0,null,null,null,null,null,"","//","//"]
[0,null,null,null,null,null,"","//","//"]
[0,null,null,null,null,null,"","//","//"]
[0,null,null,null,null,null,"","//","//"]
[0,null,null,null,null,null,"","//","//"]
[0,null,null,null,null,null,"","//","//"]
[0,null,null,null,null,null,"","//","//"]
[0,null,null,null,null,null,"","//","//"]
[0,null,null,null,null,null,"","//","//"]
[0,null,null,null,null,null,"","//","//"]
[0,null,null,null,null,null,"","//","//"]
[0,null,null,null,null,null,"","//","//"]
[0,null,null,null,null,null,"","//","//"]
[0,null,null,null,null,null,"","//","//"]
[0,null,null,null,null,null,"","//","//"]
[0,null,null,null,null,null,"","//","//"]
[0,null,null,null,null,null,"","//","//"]
[0,null,null,null,null,null,"","//","//"]
[0,null,null,null,null,null,"","//","//"]
[0,null,null,null,null,null,"","//","//"]
[0,null,null,null,null,null,"","//","//"]
[0,null,null,null,null,null,"","//","//"]
[0,null,null,null,null,null,"","//","//"]
[0,null,null,null,null,null,"","//","//"]
[0,null,null,null,null,null,"","//","//"]
[0,null,null,null,null,null,"","//","//"]
[0,null,null,null,null,null,"","//","//"]
[0,null,null,null,null,null,"","//","//"]
[0,null,null,null,null,null,"","//","//"]
[0,null,null,null,null,null,"","//","//"]
[0,null,null,null,null,null,"","//","//"]
[0,null,null,null,null,null,"","//","//"]
[0,null,null,null,null,null,"","//","//"]
[0,null,null,null,null,null,"","//","//"]
[0,null,null,null,null,null,"","//","//"]
[0,null,null,null,null,null,"","//","//"]
[0,null,null,null,null,null,"","//","//"]
[0,null,null,null,null,null,"","//","//"]
[0,null,null,null,null,null,"","//","//"]
[0,null,null,null,null,null,"","//","//"]
[0,null,null,null,null,null,"","//","//"]
[0,null,null,null,null,null,"","//","//"]
[0,null,null,null,null,null,"","//","//"]
[0,null,null,null,null,null,"","//","//"]
[0,null,null,null,null,null,"","//","//"]
[0,null,null,null,null,null,"","//","//"]
[0,null,null,null,null,null,"","//","//"]
[0,null,null,null,null,null,"","//","//"]
[0,null,null,null,null,null,"",{"$f":"IF(OR($G2560=\"NTSI\",$G2560=\"TTSI\"),$E2560,LEFT($E2560,4)&\"/\"&MID($E2560,5,2)&\"/\"&RIGHT($E2560,2))","v":"//"},{"$f":"IF(OR($G2560=\"NTSI\",$G2560=\"TTSI\"),$F2560,LEFT($F2560,4)&\"/\"&MID($F2560,5,2)&\"/\"&RIGHT($F2560,2))","v":"//"}]
[0,null,null,null,null,null,"","//","//"]
[0,null,null,null,null,null,"","//","//"]
[0,null,null,null,null,null,"","//","//"]
[0,null,null,null,null,null,"","//","//"]
[{"$f":"IF(RIGHT(B2565,1)=\"H\",LEFT(B2565,11)&\"B\",B2565)","v":0},null,null,null,null,null,{"$f":"MID(C2565,4,4)","v":""},"//","//"]
[0,null,null,null,null,null,"","//","//"]
[0,null,null,null,null,null,"","//","//"]
[0,null,null,null,null,null,"","//","//"]
[0,null,null,null,null,null,"","//","//"]
[0,null,null,null,null,null,"","//","//"]
[0,null,null,null,null,null,"","//","//"]
[0,null,null,null,null,null,"","//","//"]
[0,null,null,null,null,null,"","//","//"]
[0,null,null,null,null,null,"","//","//"]
[0,null,null,null,null,null,"","//","//"]
[0,null,null,null,null,null,"","//","//"]
[0,null,null,null,null,null,"","//","//"]
[0,null,null,null,null,null,"","//","//"]
[0,null,null,null,null,null,"","//","//"]
[0,null,null,null,null,null,"","//","//"]
[0,null,null,null,null,null,"","//","//"]
[0,null,null,null,null,null,"","//","//"]
[0,null,null,null,null,null,"","//","//"]
[0,null,null,null,null,null,"","//","//"]
[0,null,null,null,null,null,"","//","//"]
[0,null,null,null,null,null,"","//","//"]
[0,null,null,null,null,null,"","//","//"]
[0,null,null,null,null,null,"","//","//"]
[0,null,null,null,null,null,"","//","//"]
[0,null,null,null,null,null,"","//","//"]
[0,null,null,null,null,null,"","//","//"]
[0,null,null,null,null,null,"","//","//"]
[0,null,null,null,null,null,"","//","//"]
[0,null,null,null,null,null,"","//","//"]
[0,null,null,null,null,null,"","//","//"]
[0,null,null,null,null,null,"","//","//"]
[0,null,null,null,null,null,"","//","//"]
[0,null,null,null,null,null,"","//","//"]
[0,null,null,null,null,null,"","//","//"]
[0,null,null,null,null,null,"","//","//"]
[0,null,null,null,null,null,"","//","//"]
[0,null,null,null,null,null,"","//","//"]
[0,null,null,null,null,null,"","//","//"]
[0,null,null,null,null,null,"","//","//"]
[0,null,null,null,null,null,"","//","//"]
[0,null,null,null,null,null,"","//","//"]
[0,null,null,null,null,null,"","//","//"]
[0,null,null,null,null,null,"","//","//"]
[0,null,null,null,null,null,"","//","//"]
[0,null,null,null,null,null,"","//","//"]
[0,null,null,null,null,null,"","//","//"]
[0,null,null,null,null,null,"","//","//"]
[0,null,null,null,null,null,"","//","//"]
[0,null,null,null,null,null,"","//","//"]
[0,null,null,null,null,null,"","//","//"]
[0,null,null,null,null,null,"","//","//"]
[0,null,null,null,null,null,"","//","//"]
[0,null,null,null,null,null,"","//","//"]
[0,null,null,null,null,null,"","//","//"]
[0,null,null,null,null,null,"","//","//"]
[0,null,null,null,null,null,"","//","//"]
[0,null,null,null,null,null,"","//","//"]
[0,null,null,null,null,null,"","//","//"]
[0,null,null,null,null,null,"",{"$f":"IF(OR($G2624=\"NTSI\",$G2624=\"TTSI\"),$E2624,LEFT($E2624,4)&\"/\"&MID($E2624,5,2)&\"/\"&RIGHT($E2624,2))","v":"//"},{"$f":"IF(OR($G2624=\"NTSI\",$G2624=\"TTSI\"),$F2624,LEFT($F2624,4)&\"/\"&MID($F2624,5,2)&\"/\"&RIGHT($F2624,2))","v":"//"}]
[0,null,null,null,null,null,"","//","//"]
[0,null,null,null,null,null,"","//","//"]
[0,null,null,null,null,null,"","//","//"]
[0,null,null,null,null,null,"","//","//"]
[{"$f":"IF(RIGHT(B2629,1)=\"H\",LEFT(B2629,11)&\"B\",B2629)","v":0},null,null,null,null,null,{"$f":"MID(C2629,4,4)","v":""},"//","//"]
[0,null,null,null,null,null,"","//","//"]
[0,null,null,null,null,null,"","//","//"]
[0,null,null,null,null,null,"","//","//"]
[0,null,null,null,null,null,"","//","//"]
[0,null,null,null,null,null,"","//","//"]
[0,null,null,null,null,null,"","//","//"]
[0,null,null,null,null,null,"","//","//"]
[0,null,null,null,null,null,"","//","//"]
[0,null,null,null,null,null,"","//","//"]
[0,null,null,null,null,null,"","//","//"]
[0,null,null,null,null,null,"","//","//"]
[0,null,null,null,null,null,"","//","//"]
[0,null,null,null,null,null,"","//","//"]
[0,null,null,null,null,null,"","//","//"]
[0,null,null,null,null,null,"","//","//"]
[0,null,null,null,null,null,"","//","//"]
[0,null,null,null,null,null,"","//","//"]
[0,null,null,null,null,null,"","//","//"]
[0,null,null,null,null,null,"","//","//"]
[0,null,null,null,null,null,"","//","//"]
[0,null,null,null,null,null,"","//","//"]
[0,null,null,null,null,null,"","//","//"]
[0,null,null,null,null,null,"","//","//"]
[0,null,null,null,null,null,"","//","//"]
[0,null,null,null,null,null,"","//","//"]
[0,null,null,null,null,null,"","//","//"]
[0,null,null,null,null,null,"","//","//"]
[0,null,null,null,null,null,"","//","//"]
[0,null,null,null,null,null,"","//","//"]
[0,null,null,null,null,null,"","//","//"]
[0,null,null,null,null,null,"","//","//"]
[0,null,null,null,null,null,"","//","//"]
[0,null,null,null,null,null,"","//","//"]
[0,null,null,null,null,null,"","//","//"]
[0,null,null,null,null,null,"","//","//"]
[0,null,null,null,null,null,"","//","//"]
[0,null,null,null,null,null,"","//","//"]
[0,null,null,null,null,null,"","//","//"]
[0,null,null,null,null,null,"","//","//"]
[0,null,null,null,null,null,"","//","//"]
[0,null,null,null,null,null,"","//","//"]
[0,null,null,null,null,null,"","//","//"]
[0,null,null,null,null,null,"","//","//"]
[0,null,null,null,null,null,"","//","//"]
[0,null,null,null,null,null,"","//","//"]
[0,null,null,null,null,null,"","//","//"]
[0,null,null,null,null,null,"","//","//"]
[0,null,null,null,null,null,"","//","//"]
[0,null,null,null,null,null,"","//","//"]
[0,null,null,null,null,null,"","//","//"]
[0,null,null,null,null,null,"","//","//"]
[0,null,null,null,null,null,"","//","//"]
[0,null,null,null,null,null,"","//","//"]
[0,null,null,null,null,null,"","//","//"]
[0,null,null,null,null,null,"","//","//"]
[0,null,null,null,null,null,"","//","//"]
[0,null,null,null,null,null,"","//","//"]
[0,null,null,null,null,null,"","//","//"]
[0,null,null,null,null,null,"",{"$f":"IF(OR($G2688=\"NTSI\",$G2688=\"TTSI\"),$E2688,LEFT($E2688,4)&\"/\"&MID($E2688,5,2)&\"/\"&RIGHT($E2688,2))","v":"//"},{"$f":"IF(OR($G2688=\"NTSI\",$G2688=\"TTSI\"),$F2688,LEFT($F2688,4)&\"/\"&MID($F2688,5,2)&\"/\"&RIGHT($F2688,2))","v":"//"}]
[0,null,null,null,null,null,"","//","//"]
[0,null,null,null,null,null,"","//","//"]
[0,null,null,null,null,null,"","//","//"]
[0,null,null,null,null,null,"","//","//"]
[{"$f":"IF(RIGHT(B2693,1)=\"H\",LEFT(B2693,11)&\"B\",B2693)","v":0},null,null,null,null,null,{"$f":"MID(C2693,4,4)","v":""},"//","//"]
[0,null,null,null,null,null,"","//","//"]
[0,null,null,null,null,null,"","//","//"]
[0,null,null,null,null,null,"","//","//"]
[0,null,null,null,null,null,"","//","//"]
[0,null,null,null,null,null,"","//","//"]
[0,null,null,null,null,null,"","//","//"]
[0,null,null,null,null,null,"","//","//"]
[0,null,null,null,null,null,"","//","//"]
[0,null,null,null,null,null,"","//","//"]
[0,null,null,null,null,null,"","//","//"]
[0,null,null,null,null,null,"","//","//"]
[0,null,null,null,null,null,"","//","//"]
[0,null,null,null,null,null,"","//","//"]
[0,null,null,null,null,null,"","//","//"]
[0,null,null,null,null,null,"","//","//"]
[0,null,null,null,null,null,"","//","//"]
[0,null,null,null,null,null,"","//","//"]
[0,null,null,null,null,null,"","//","//"]
[0,null,null,null,null,null,"","//","//"]
[0,null,null,null,null,null,"","//","//"]
[0,null,null,null,null,null,"","//","//"]
[0,null,null,null,null,null,"","//","//"]
[0,null,null,null,null,null,"","//","//"]
[0,null,null,null,null,null,"","//","//"]
[0,null,null,null,null,null,"","//","//"]
[0,null,null,null,null,null,"","//","//"]
[0,null,null,null,null,null,"","//","//"]
[0,null,null,null,null,null,"","//","//"]
[0,null,null,null,null,null,"","//","//"]
[0,null,null,null,null,null,"","//","//"]
[0,null,null,null,null,null,"","//","//"]
[0,null,null,null,null,null,"","//","//"]
[0,null,null,null,null,null,"","//","//"]
[0,null,null,null,null,null,"","//","//"]
[0,null,null,null,null,null,"","//","//"]
[0,null,null,null,null,null,"","//","//"]
[0,null,null,null,null,null,"","//","//"]
[0,null,null,null,null,null,"","//","//"]
[0,null,null,null,null,null,"","//","//"]
[0,null,null,null,null,null,"","//","//"]
[0,null,null,null,null,null,"","//","//"]
[0,null,null,null,null,null,"","//","//"]
[0,null,null,null,null,null,"","//","//"]
[0,null,null,null,null,null,"","//","//"]
[0,null,null,null,null,null,"","//","//"]
[0,null,null,null,null,null,"","//","//"]
[0,null,null,null,null,null,"","//","//"]
[0,null,null,null,null,null,"","//","//"]
[0,null,null,null,null,null,"","//","//"]
[0,null,null,null,null,null,"","//","//"]
[0,null,null,null,null,null,"","//","//"]
[0,null,null,null,null,null,"","//","//"]
[0,null,null,null,null,null,"","//","//"]
[0,null,null,null,null,null,"","//","//"]
[0,null,null,null,null,null,"","//","//"]
[0,null,null,null,null,null,"","//","//"]
[0,null,null,null,null,null,"","//","//"]
[0,null,null,null,null,null,"","//","//"]
[0,null,null,null,null,null,"",{"$f":"IF(OR($G2752=\"NTSI\",$G2752=\"TTSI\"),$E2752,LEFT($E2752,4)&\"/\"&MID($E2752,5,2)&\"/\"&RIGHT($E2752,2))","v":"//"},{"$f":"IF(OR($G2752=\"NTSI\",$G2752=\"TTSI\"),$F2752,LEFT($F2752,4)&\"/\"&MID($F2752,5,2)&\"/\"&RIGHT($F2752,2))","v":"//"}]
[0,null,null,null,null,null,"","//","//"]
[0,null,null,null,null,null,"","//","//"]
[0,null,null,null,null,null,"","//","//"]
[0,null,null,null,null,null,"","//","//"]
[{"$f":"IF(RIGHT(B2757,1)=\"H\",LEFT(B2757,11)&\"B\",B2757)","v":0},null,null,null,null,null,{"$f":"MID(C2757,4,4)","v":""},"//","//"]
[0,null,null,null,null,null,"","//","//"]
[0,null,null,null,null,null,"","//","//"]
[0,null,null,null,null,null,"","//","//"]
[0,null,null,null,null,null,"","//","//"]
[0,null,null,null,null,null,"","//","//"]
[0,null,null,null,null,null,"","//","//"]
[0,null,null,null,null,null,"","//","//"]
[0,null,null,null,null,null,"","//","//"]
[0,null,null,null,null,null,"","//","//"]
[0,null,null,null,null,null,"","//","//"]
[0,null,null,null,null,null,"","//","//"]
[0,null,null,null,null,null,"","//","//"]
[0,null,null,null,null,null,"","//","//"]
[0,null,null,null,null,null,"","//","//"]
[0,null,null,null,null,null,"","//","//"]
[0,null,null,null,null,null,"","//","//"]
[0,null,null,null,null,null,"","//","//"]
[0,null,null,null,null,null,"","//","//"]
[0,null,null,null,null,null,"","//","//"]
[0,null,null,null,null,null,"","//","//"]
[0,null,null,null,null,null,"","//","//"]
[0,null,null,null,null,null,"","//","//"]
[0,null,null,null,null,null,"","//","//"]
[0,null,null,null,null,null,"","//","//"]
[0,null,null,null,null,null,"","//","//"]
[0,null,null,null,null,null,"","//","//"]
[0,null,null,null,null,null,"","//","//"]
[0,null,null,null,null,null,"","//","//"]
[0,null,null,null,null,null,"","//","//"]
[0,null,null,null,null,null,"","//","//"]
[0,null,null,null,null,null,"","//","//"]
[0,null,null,null,null,null,"","//","//"]
[0,null,null,null,null,null,"","//","//"]
[0,null,null,null,null,null,"","//","//"]
[0,null,null,null,null,null,"","//","//"]
[0,null,null,null,null,null,"","//","//"]
[0,null,null,null,null,null,"","//","//"]
[0,null,null,null,null,null,"","//","//"]
[0,null,null,null,null,null,"","//","//"]
[0,null,null,null,null,null,"","//","//"]
[0,null,null,null,null,null,"","//","//"]
[0,null,null,null,null,null,"","//","//"]
[0,null,null,null,null,null,"","//","//"]
[0,null,null,null,null,null,"","//","//"]
[0,null,null,null,null,null,"","//","//"]
[0,null,null,null,null,null,"","//","//"]
[0,null,null,null,null,null,"","//","//"]
[0,null,null,null,null,null,"","//","//"]
[0,null,null,null,null,null,"","//","//"]
[0,null,null,null,null,null,"","//","//"]
[0,null,null,null,null,null,"","//","//"]
[0,null,null,null,null,null,"","//","//"]
[0,null,null,null,null,null,"","//","//"]
[0,null,null,null,null,null,"","//","//"]
[0,null,null,null,null,null,"","//","//"]
[0,null,null,null,null,null,"","//","//"]
[0,null,null,null,null,null,"","//","//"]
[0,null,null,null,null,null,"","//","//"]
[0,null,null,null,null,null,"",{"$f":"IF(OR($G2816=\"NTSI\",$G2816=\"TTSI\"),$E2816,LEFT($E2816,4)&\"/\"&MID($E2816,5,2)&\"/\"&RIGHT($E2816,2))","v":"//"},{"$f":"IF(OR($G2816=\"NTSI\",$G2816=\"TTSI\"),$F2816,LEFT($F2816,4)&\"/\"&MID($F2816,5,2)&\"/\"&RIGHT($F2816,2))","v":"//"}]
[0,null,null,null,null,null,"","//","//"]
[0,null,null,null,null,null,"","//","//"]
[0,null,null,null,null,null,"","//","//"]
[0,null,null,null,null,null,"","//","//"]
[{"$f":"IF(RIGHT(B2821,1)=\"H\",LEFT(B2821,11)&\"B\",B2821)","v":0},null,null,null,null,null,{"$f":"MID(C2821,4,4)","v":""},"//","//"]
[0,null,null,null,null,null,"","//","//"]
[0,null,null,null,null,null,"","//","//"]
[0,null,null,null,null,null,"","//","//"]
[0,null,null,null,null,null,"","//","//"]
[0,null,null,null,null,null,"","//","//"]
[0,null,null,null,null,null,"","//","//"]
[0,null,null,null,null,null,"","//","//"]
[0,null,null,null,null,null,"","//","//"]
[0,null,null,null,null,null,"","//","//"]
[0,null,null,null,null,null,"","//","//"]
[0,null,null,null,null,null,"","//","//"]
[0,null,null,null,null,null,"","//","//"]
[0,null,null,null,null,null,"","//","//"]
[0,null,null,null,null,null,"","//","//"]
[0,null,null,null,null,null,"","//","//"]
[0,null,null,null,null,null,"","//","//"]
[0,null,null,null,null,null,"","//","//"]
[0,null,null,null,null,null,"","//","//"]
[0,null,null,null,null,null,"","//","//"]
[0,null,null,null,null,null,"","//","//"]
[0,null,null,null,null,null,"","//","//"]
[0,null,null,null,null,null,"","//","//"]
[0,null,null,null,null,null,"","//","//"]
[0,null,null,null,null,null,"","//","//"]
[0,null,null,null,null,null,"","//","//"]
[0,null,null,null,null,null,"","//","//"]
[0,null,null,null,null,null,"","//","//"]
[0,null,null,null,null,null,"","//","//"]
[0,null,null,null,null,null,"","//","//"]
[0,null,null,null,null,null,"","//","//"]
[0,null,null,null,null,null,"","//","//"]
[0,null,null,null,null,null,"","//","//"]
[0,null,null,null,null,null,"","//","//"]
[0,null,null,null,null,null,"","//","//"]
[0,null,null,null,null,null,"","//","//"]
[0,null,null,null,null,null,"","//","//"]
[0,null,null,null,null,null,"","//","//"]
[0,null,null,null,null,null,"","//","//"]
[0,null,null,null,null,null,"","//","//"]
[0,null,null,null,null,null,"","//","//"]
[0,null,null,null,null,null,"","//","//"]
[0,null,null,null,null,null,"","//","//"]
[0,null,null,null,null,null,"","//","//"]
[0,null,null,null,null,null,"","//","//"]
[0,null,null,null,null,null,"","//","//"]
[0,null,null,null,null,null,"","//","//"]
[0,null,null,null,null,null,"","//","//"]
[0,null,null,null,null,null,"","//","//"]
[0,null,null,null,null,null,"","//","//"]
[0,null,null,null,null,null,"","//","//"]
[0,null,null,null,null,null,"","//","//"]
[0,null,null,null,null,null,"","//","//"]
[0,null,null,null,null,null,"","//","//"]
[0,null,null,null,null,null,"","//","//"]
[0,null,null,null,null,null,"","//","//"]
[0,null,null,null,null,null,"","//","//"]
[0,null,null,null,null,null,"","//","//"]
[0,null,null,null,null,null,"","//","//"]
[0,null,null,null,null,null,"",{"$f":"IF(OR($G2880=\"NTSI\",$G2880=\"TTSI\"),$E2880,LEFT($E2880,4)&\"/\"&MID($E2880,5,2)&\"/\"&RIGHT($E2880,2))","v":"//"},{"$f":"IF(OR($G2880=\"NTSI\",$G2880=\"TTSI\"),$F2880,LEFT($F2880,4)&\"/\"&MID($F2880,5,2)&\"/\"&RIGHT($F2880,2))","v":"//"}]
[0,null,null,null,null,null,"","//","//"]
[0,null,null,null,null,null,"","//","//"]
[0,null,null,null,null,null,"","//","//"]
[0,null,null,null,null,null,"","//","//"]
[{"$f":"IF(RIGHT(B2885,1)=\"H\",LEFT(B2885,11)&\"B\",B2885)","v":0},null,null,null,null,null,{"$f":"MID(C2885,4,4)","v":""},"//","//"]
[0,null,null,null,null,null,"","//","//"]
[0,null,null,null,null,null,"","//","//"]
[0,null,null,null,null,null,"","//","//"]
[0,null,null,null,null,null,"","//","//"]
[0,null,null,null,null,null,"","//","//"]
[0,null,null,null,null,null,"","//","//"]
[0,null,null,null,null,null,"","//","//"]
[0,null,null,null,null,null,"","//","//"]
[0,null,null,null,null,null,"","//","//"]
[0,null,null,null,null,null,"","//","//"]
[0,null,null,null,null,null,"","//","//"]
[0,null,null,null,null,null,"","//","//"]
[0,null,null,null,null,null,"","//","//"]
[0,null,null,null,null,null,"","//","//"]
[0,null,null,null,null,null,"","//","//"]
[0,null,null,null,null,null,"","//","//"]
[0,null,null,null,null,null,"","//","//"]
[0,null,null,null,null,null,"","//","//"]
[0,null,null,null,null,null,"","//","//"]
[0,null,null,null,null,null,"","//","//"]
[0,null,null,null,null,null,"","//","//"]
[0,null,null,null,null,null,"","//","//"]
[0,null,null,null,null,null,"","//","//"]
[0,null,null,null,null,null,"","//","//"]
[0,null,null,null,null,null,"","//","//"]
[0,null,null,null,null,null,"","//","//"]
[0,null,null,null,null,null,"","//","//"]
[0,null,null,null,null,null,"","//","//"]
[0,null,null,null,null,null,"","//","//"]
[0,null,null,null,null,null,"","//","//"]
[0,null,null,null,null,null,"","//","//"]
[0,null,null,null,null,null,"","//","//"]
[0,null,null,null,null,null,"","//","//"]
[0,null,null,null,null,null,"","//","//"]
[0,null,null,null,null,null,"","//","//"]
[0,null,null,null,null,null,"","//","//"]
[0,null,null,null,null,null,"","//","//"]
[0,null,null,null,null,null,"","//","//"]
[0,null,null,null,null,null,"","//","//"]
[0,null,null,null,null,null,"","//","//"]
[0,null,null,null,null,null,"","//","//"]
[0,null,null,null,null,null,"","//","//"]
[0,null,null,null,null,null,"","//","//"]
[0,null,null,null,null,null,"","//","//"]
[0,null,null,null,null,null,"","//","//"]
[0,null,null,null,null,null,"","//","//"]
[0,null,null,null,null,null,"","//","//"]
[0,null,null,null,null,null,"","//","//"]
[0,null,null,null,null,null,"","//","//"]
[0,null,null,null,null,null,"","//","//"]
[0,null,null,null,null,null,"","//","//"]
[0,null,null,null,null,null,"","//","//"]
[0,null,null,null,null,null,"","//","//"]
[0,null,null,null,null,null,"","//","//"]
[0,null,null,null,null,null,"","//","//"]
[0,null,null,null,null,null,"","//","//"]
[0,null,null,null,null,null,"","//","//"]
[0,null,null,null,null,null,"","//","//"]
[0,null,null,null,null,null,"",{"$f":"IF(OR($G2944=\"NTSI\",$G2944=\"TTSI\"),$E2944,LEFT($E2944,4)&\"/\"&MID($E2944,5,2)&\"/\"&RIGHT($E2944,2))","v":"//"},{"$f":"IF(OR($G2944=\"NTSI\",$G2944=\"TTSI\"),$F2944,LEFT($F2944,4)&\"/\"&MID($F2944,5,2)&\"/\"&RIGHT($F2944,2))","v":"//"}]
[0,null,null,null,null,null,"","//","//"]
[0,null,null,null,null,null,"","//","//"]
[0,null,null,null,null,null,"","//","//"]
[0,null,null,null,null,null,"","//","//"]
[{"$f":"IF(RIGHT(B2949,1)=\"H\",LEFT(B2949,11)&\"B\",B2949)","v":0},null,null,null,null,null,{"$f":"MID(C2949,4,4)","v":""},"//","//"]
[0,null,null,null,null,null,"","//","//"]
[0,null,null,null,null,null,"","//","//"]
[0,null,null,null,null,null,"","//","//"]
[0,null,null,null,null,null,"","//","//"]
[0,null,null,null,null,null,"","//","//"]
[0,null,null,null,null,null,"","//","//"]
[0,null,null,null,null,null,"","//","//"]
[0,null,null,null,null,null,"","//","//"]
[0,null,null,null,null,null,"","//","//"]
[0,null,null,null,null,null,"","//","//"]
[0,null,null,null,null,null,"","//","//"]
[0,null,null,null,null,null,"","//","//"]
[0,null,null,null,null,null,"","//","//"]
[0,null,null,null,null,null,"","//","//"]
[0,null,null,null,null,null,"","//","//"]
[0,null,null,null,null,null,"","//","//"]
[0,null,null,null,null,null,"","//","//"]
[0,null,null,null,null,null,"","//","//"]
[0,null,null,null,null,null,"","//","//"]
[0,null,null,null,null,null,"","//","//"]
[0,null,null,null,null,null,"","//","//"]
[0,null,null,null,null,null,"","//","//"]
[0,null,null,null,null,null,"","//","//"]
[0,null,null,null,null,null,"","//","//"]
[0,null,null,null,null,null,"","//","//"]
[0,null,null,null,null,null,"","//","//"]
[0,null,null,null,null,null,"","//","//"]
[0,null,null,null,null,null,"","//","//"]
[0,null,null,null,null,null,"","//","//"]
[0,null,null,null,null,null,"","//","//"]
[0,null,null,null,null,null,"","//","//"]
[0,null,null,null,null,null,"","//","//"]
[0,null,null,null,null,null,"","//","//"]
[0,null,null,null,null,null,"","//","//"]
[0,null,null,null,null,null,"","//","//"]
[0,null,null,null,null,null,"","//","//"]
[0,null,null,null,null,null,"","//","//"]
[0,null,null,null,null,null,"","//","//"]
[0,null,null,null,null,null,"","//","//"]
[0,null,null,null,null,null,"","//","//"]
[0,null,null,null,null,null,"","//","//"]
[0,null,null,null,null,null,"","//","//"]
[0,null,null,null,null,null,"","//","//"]
[0,null,null,null,null,null,"","//","//"]
[0,null,null,null,null,null,"","//","//"]
[0,null,null,null,null,null,"","//","//"]
[0,null,null,null,null,null,"","//","//"]
[0,null,null,null,null,null,"","//","//"]
[0,null,null,null,null,null,"","//","//"]
[0,null,null,null,null,null,"","//","//"]
[0,null,null,null,null,null,"","//","//"]
[0,null,null,null,null,null,"","//","//"]
[0,null,null,null,null,null,"","//","//"]
[0,null,null,null,null,null,"","//","//"]
[0,null,null,null,null,null,"","//","//"]
[0,null,null,null,null,null,"","//","//"]
[0,null,null,null,null,null,"","//","//"]
[0,null,null,null,null,null,"","//","//"]
[0,null,null,null,null,null,"",{"$f":"IF(OR($G3008=\"NTSI\",$G3008=\"TTSI\"),$E3008,LEFT($E3008,4)&\"/\"&MID($E3008,5,2)&\"/\"&RIGHT($E3008,2))","v":"//"},{"$f":"IF(OR($G3008=\"NTSI\",$G3008=\"TTSI\"),$F3008,LEFT($F3008,4)&\"/\"&MID($F3008,5,2)&\"/\"&RIGHT($F3008,2))","v":"//"}]
[0,null,null,null,null,null,"","//","//"]
[0,null,null,null,null,null,"","//","//"]
[0,null,null,null,null,null,"","//","//"]
[0,null,null,null,null,null,"","//","//"]
[{"$f":"IF(RIGHT(B3013,1)=\"H\",LEFT(B3013,11)&\"B\",B3013)","v":0},null,null,null,null,null,{"$f":"MID(C3013,4,4)","v":""},"//","//"]
[0,null,null,null,null,null,"","//","//"]
[0,null,null,null,null,null,"","//","//"]
[0,null,null,null,null,null,"","//","//"]
[0,null,null,null,null,null,"","//","//"]
[0,null,null,null,null,null,"","//","//"]
[0,null,null,null,null,null,"","//","//"]
[0,null,null,null,null,null,"","//","//"]
[0,null,null,null,null,null,"","//","//"]
[0,null,null,null,null,null,"","//","//"]
[0,null,null,null,null,null,"","//","//"]
[0,null,null,null,null,null,"","//","//"]
[0,null,null,null,null,null,"","//","//"]
[0,null,null,null,null,null,"","//","//"]
[0,null,null,null,null,null,"","//","//"]
[0,null,null,null,null,null,"","//","//"]
[0,null,null,null,null,null,"","//","//"]
[0,null,null,null,null,null,"","//","//"]
[0,null,null,null,null,null,"","//","//"]
[0,null,null,null,null,null,"","//","//"]
[0,null,null,null,null,null,"","//","//"]
[0,null,null,null,null,null,"","//","//"]
[0,null,null,null,null,null,"","//","//"]
[0,null,null,null,null,null,"","//","//"]
[0,null,null,null,null,null,"","//","//"]
[0,null,null,null,null,null,"","//","//"]
[0,null,null,null,null,null,"","//","//"]
[0,null,null,null,null,null,"","//","//"]
[0,null,null,null,null,null,"","//","//"]
[0,null,null,null,null,null,"","//","//"]
[0,null,null,null,null,null,"","//","//"]
[0,null,null,null,null,null,"","//","//"]
[0,null,null,null,null,null,"","//","//"]
[0,null,null,null,null,null,"","//","//"]
[0,null,null,null,null,null,"","//","//"]
[0,null,null,null,null,null,"","//","//"]
[0,null,null,null,null,null,"","//","//"]
[0,null,null,null,null,null,"","//","//"]
[0,null,null,null,null,null,"","//","//"]
[0,null,null,null,null,null,"","//","//"]
[0,null,null,null,null,null,"","//","//"]
[0,null,null,null,null,null,"","//","//"]
[0,null,null,null,null,null,"","//","//"]
[0,null,null,null,null,null,"","//","//"]
[0,null,null,null,null,null,"","//","//"]
[0,null,null,null,null,null,"","//","//"]
[0,null,null,null,null,null,"","//","//"]
[0,null,null,null,null,null,"","//","//"]
[0,null,null,null,null,null,"","//","//"]
[0,null,null,null,null,null,"","//","//"]
[0,null,null,null,null,null,"","//","//"]
[0,null,null,null,null,null,"","//","//"]
[0,null,null,null,null,null,"","//","//"]
[0,null,null,null,null,null,"","//","//"]
[0,null,null,null,null,null,"","//","//"]
[0,null,null,null,null,null,"","//","//"]
[0,null,null,null,null,null,"","//","//"]
[0,null,null,null,null,null,"","//","//"]
[0,null,null,null,null,null,"","//","//"]
[0,null,null,null,null,null,"",{"$f":"IF(OR($G3072=\"NTSI\",$G3072=\"TTSI\"),$E3072,LEFT($E3072,4)&\"/\"&MID($E3072,5,2)&\"/\"&RIGHT($E3072,2))","v":"//"},{"$f":"IF(OR($G3072=\"NTSI\",$G3072=\"TTSI\"),$F3072,LEFT($F3072,4)&\"/\"&MID($F3072,5,2)&\"/\"&RIGHT($F3072,2))","v":"//"}]
[0,null,null,null,null,null,"","//","//"]
[0,null,null,null,null,null,"","//","//"]
[0,null,null,null,null,null,"","//","//"]
[0,null,null,null,null,null,"","//","//"]
[{"$f":"IF(RIGHT(B3077,1)=\"H\",LEFT(B3077,11)&\"B\",B3077)","v":0},null,null,null,null,null,{"$f":"MID(C3077,4,4)","v":""},"//","//"]
[0,null,null,null,null,null,"","//","//"]
[0,null,null,null,null,null,"","//","//"]
[0,null,null,null,null,null,"","//","//"]
[0,null,null,null,null,null,"","//","//"]
[0,null,null,null,null,null,"","//","//"]
[0,null,null,null,null,null,"","//","//"]
[0,null,null,null,null,null,"","//","//"]
[0,null,null,null,null,null,"","//","//"]
[0,null,null,null,null,null,"","//","//"]
[0,null,null,null,null,null,"","//","//"]
[0,null,null,null,null,null,"","//","//"]
[0,null,null,null,null,null,"","//","//"]
[0,null,null,null,null,null,"","//","//"]
[0,null,null,null,null,null,"","//","//"]
[0,null,null,null,null,null,"","//","//"]
[0,null,null,null,null,null,"","//","//"]
[0,null,null,null,null,null,"","//","//"]
[0,null,null,null,null,null,"","//","//"]
[0,null,null,null,null,null,"","//","//"]
[0,null,null,null,null,null,"","//","//"]
[0,null,null,null,null,null,"","//","//"]
[0,null,null,null,null,null,"","//","//"]
[0,null,null,null,null,null,"","//","//"]
[0,null,null,null,null,null,"","//","//"]
[0,null,null,null,null,null,"","//","//"]
[0,null,null,null,null,null,"","//","//"]
[0,null,null,null,null,null,"","//","//"]
[0,null,null,null,null,null,"","//","//"]
[0,null,null,null,null,null,"","//","//"]
[0,null,null,null,null,null,"","//","//"]
[0,null,null,null,null,null,"","//","//"]
[0,null,null,null,null,null,"","//","//"]
[0,null,null,null,null,null,"","//","//"]
[0,null,null,null,null,null,"","//","//"]
[0,null,null,null,null,null,"","//","//"]
[0,null,null,null,null,null,"","//","//"]
[0,null,null,null,null,null,"","//","//"]
[0,null,null,null,null,null,"","//","//"]
[0,null,null,null,null,null,"","//","//"]
[0,null,null,null,null,null,"","//","//"]
[0,null,null,null,null,null,"","//","//"]
[0,null,null,null,null,null,"","//","//"]
[0,null,null,null,null,null,"","//","//"]
[0,null,null,null,null,null,"","//","//"]
[0,null,null,null,null,null,"","//","//"]
[0,null,null,null,null,null,"","//","//"]
[0,null,null,null,null,null,"","//","//"]
[0,null,null,null,null,null,"","//","//"]
[0,null,null,null,null,null,"","//","//"]
[0,null,null,null,null,null,"","//","//"]
[0,null,null,null,null,null,"","//","//"]
[0,null,null,null,null,null,"","//","//"]
[0,null,null,null,null,null,"","//","//"]
[0,null,null,null,null,null,"","//","//"]
[0,null,null,null,null,null,"","//","//"]
[0,null,null,null,null,null,"","//","//"]
[0,null,null,null,null,null,"","//","//"]
[0,null,null,null,null,null,"","//","//"]
[0,null,null,null,null,null,"",{"$f":"IF(OR($G3136=\"NTSI\",$G3136=\"TTSI\"),$E3136,LEFT($E3136,4)&\"/\"&MID($E3136,5,2)&\"/\"&RIGHT($E3136,2))","v":"//"},{"$f":"IF(OR($G3136=\"NTSI\",$G3136=\"TTSI\"),$F3136,LEFT($F3136,4)&\"/\"&MID($F3136,5,2)&\"/\"&RIGHT($F3136,2))","v":"//"}]
[0,null,null,null,null,null,"","//","//"]
[0,null,null,null,null,null,"","//","//"]
[0,null,null,null,null,null,"","//","//"]
[0,null,null,null,null,null,"","//","//"]
[{"$f":"IF(RIGHT(B3141,1)=\"H\",LEFT(B3141,11)&\"B\",B3141)","v":0},null,null,null,null,null,{"$f":"MID(C3141,4,4)","v":""},"//","//"]
[0,null,null,null,null,null,"","//","//"]
[0,null,null,null,null,null,"","//","//"]
[0,null,null,null,null,null,"","//","//"]
[0,null,null,null,null,null,"","//","//"]
[0,null,null,null,null,null,"","//","//"]
[0,null,null,null,null,null,"","//","//"]
[0,null,null,null,null,null,"","//","//"]
[0,null,null,null,null,null,"","//","//"]
[0,null,null,null,null,null,"","//","//"]
[0,null,null,null,null,null,"","//","//"]
[0,null,null,null,null,null,"","//","//"]
[0,null,null,null,null,null,"","//","//"]
[0,null,null,null,null,null,"","//","//"]
[0,null,null,null,null,null,"","//","//"]
[0,null,null,null,null,null,"","//","//"]
[0,null,null,null,null,null,"","//","//"]
[0,null,null,null,null,null,"","//","//"]
[0,null,null,null,null,null,"","//","//"]
[0,null,null,null,null,null,"","//","//"]
[0,null,null,null,null,null,"","//","//"]
[0,null,null,null,null,null,"","//","//"]
[0,null,null,null,null,null,"","//","//"]
[0,null,null,null,null,null,"","//","//"]
[0,null,null,null,null,null,"","//","//"]
[0,null,null,null,null,null,"","//","//"]
[0,null,null,null,null,null,"","//","//"]
[0,null,null,null,null,null,"","//","//"]
[0,null,null,null,null,null,"","//","//"]
[0,null,null,null,null,null,"","//","//"]
[0,null,null,null,null,null,"","//","//"]
[0,null,null,null,null,null,"","//","//"]
[0,null,null,null,null,null,"","//","//"]
[0,null,null,null,null,null,"","//","//"]
[0,null,null,null,null,null,"","//","//"]
[0,null,null,null,null,null,"","//","//"]
[0,null,null,null,null,null,"","//","//"]
[0,null,null,null,null,null,"","//","//"]
[0,null,null,null,null,null,"","//","//"]
[0,null,null,null,null,null,"","//","//"]
[0,null,null,null,null,null,"","//","//"]
[0,null,null,null,null,null,"","//","//"]
[0,null,null,null,null,null,"","//","//"]
[0,null,null,null,null,null,"","//","//"]
[0,null,null,null,null,null,"","//","//"]
[0,null,null,null,null,null,"","//","//"]
[0,null,null,null,null,null,"","//","//"]
[0,null,null,null,null,null,"","//","//"]
[0,null,null,null,null,null,"","//","//"]
[0,null,null,null,null,null,"","//","//"]
[0,null,null,null,null,null,"","//","//"]
[0,null,null,null,null,null,"","//","//"]
[0,null,null,null,null,null,"","//","//"]
[0,null,null,null,null,null,"","//","//"]
[0,null,null,null,null,null,"","//","//"]
[0,null,null,null,null,null,"","//","//"]
[0,null,null,null,null,null,"","//","//"]
[0,null,null,null,null,null,"","//","//"]
[0,null,null,null,null,null,"","//","//"]
[0,null,null,null,null,null,"",{"$f":"IF(OR($G3200=\"NTSI\",$G3200=\"TTSI\"),$E3200,LEFT($E3200,4)&\"/\"&MID($E3200,5,2)&\"/\"&RIGHT($E3200,2))","v":"//"},{"$f":"IF(OR($G3200=\"NTSI\",$G3200=\"TTSI\"),$F3200,LEFT($F3200,4)&\"/\"&MID($F3200,5,2)&\"/\"&RIGHT($F3200,2))","v":"//"}]
[0,null,null,null,null,null,"","//","//"]
[0,null,null,null,null,null,"","//","//"]
[0,null,null,null,null,null,"","//","//"]
[0,null,null,null,null,null,"","//","//"]
[{"$f":"IF(RIGHT(B3205,1)=\"H\",LEFT(B3205,11)&\"B\",B3205)","v":0},null,null,null,null,null,{"$f":"MID(C3205,4,4)","v":""},"//","//"]
[0,null,null,null,null,null,"","//","//"]
[0,null,null,null,null,null,"","//","//"]
[0,null,null,null,null,null,"","//","//"]
[0,null,null,null,null,null,"","//","//"]
[0,null,null,null,null,null,"","//","//"]
[0,null,null,null,null,null,"","//","//"]
[0,null,null,null,null,null,"","//","//"]
[0,null,null,null,null,null,"","//","//"]
[0,null,null,null,null,null,"","//","//"]
[0,null,null,null,null,null,"","//","//"]
[0,null,null,null,null,null,"","//","//"]
[0,null,null,null,null,null,"","//","//"]
[0,null,null,null,null,null,"","//","//"]
[0,null,null,null,null,null,"","//","//"]
[0,null,null,null,null,null,"","//","//"]
[0,null,null,null,null,null,"","//","//"]
[0,null,null,null,null,null,"","//","//"]
[0,null,null,null,null,null,"","//","//"]
[0,null,null,null,null,null,"","//","//"]
[0,null,null,null,null,null,"","//","//"]
[0,null,null,null,null,null,"","//","//"]
[0,null,null,null,null,null,"","//","//"]
[0,null,null,null,null,null,"","//","//"]
[0,null,null,null,null,null,"","//","//"]
[0,null,null,null,null,null,"","//","//"]
[0,null,null,null,null,null,"","//","//"]
[0,null,null,null,null,null,"","//","//"]
[0,null,null,null,null,null,"","//","//"]
[0,null,null,null,null,null,"","//","//"]
[0,null,null,null,null,null,"","//","//"]
[0,null,null,null,null,null,"","//","//"]
[0,null,null,null,null,null,"","//","//"]
[0,null,null,null,null,null,"","//","//"]
[0,null,null,null,null,null,"","//","//"]
[0,null,null,null,null,null,"","//","//"]
[0,null,null,null,null,null,"","//","//"]
[0,null,null,null,null,null,"","//","//"]
[0,null,null,null,null,null,"","//","//"]
[0,null,null,null,null,null,"","//","//"]
[0,null,null,null,null,null,"","//","//"]
[0,null,null,null,null,null,"","//","//"]
[0,null,null,null,null,null,"","//","//"]
[0,null,null,null,null,null,"","//","//"]
[0,null,null,null,null,null,"","//","//"]
[0,null,null,null,null,null,"","//","//"]
[0,null,null,null,null,null,"","//","//"]
[0,null,null,null,null,null,"","//","//"]
[0,null,null,null,null,null,"","//","//"]
[0,null,null,null,null,null,"","//","//"]
[0,null,null,null,null,null,"","//","//"]
[0,null,null,null,null,null,"","//","//"]
[0,null,null,null,null,null,"","//","//"]
[0,null,null,null,null,null,"","//","//"]
[0,null,null,null,null,null,"","//","//"]
[0,null,null,null,null,null,"","//","//"]
[0,null,null,null,null,null,"","//","//"]
[0,null,null,null,null,null,"","//","//"]
[0,null,null,null,null,null,"","//","//"]
[0,null,null,null,null,null,"",{"$f":"IF(OR($G3264=\"NTSI\",$G3264=\"TTSI\"),$E3264,LEFT($E3264,4)&\"/\"&MID($E3264,5,2)&\"/\"&RIGHT($E3264,2))","v":"//"},{"$f":"IF(OR($G3264=\"NTSI\",$G3264=\"TTSI\"),$F3264,LEFT($F3264,4)&\"/\"&MID($F3264,5,2)&\"/\"&RIGHT($F3264,2))","v":"//"}]
[0,null,null,null,null,null,"","//","//"]
[0,null,null,null,null,null,"","//","//"]
[0,null,null,null,null,null,"","//","//"]
[0,null,null,null,null,null,"","//","//"]
[{"$f":"IF(RIGHT(B3269,1)=\"H\",LEFT(B3269,11)&\"B\",B3269)","v":0},null,null,null,null,null,{"$f":"MID(C3269,4,4)","v":""},"//","//"]
[0,null,null,null,null,null,"","//","//"]
[0,null,null,null,null,null,"","//","//"]
[0,null,null,null,null,null,"","//","//"]
[0,null,null,null,null,null,"","//","//"]
[0,null,null,null,null,null,"","//","//"]
[0,null,null,null,null,null,"","//","//"]
[0,null,null,null,null,null,"","//","//"]
[0,null,null,null,null,null,"","//","//"]
[0,null,null,null,null,null,"","//","//"]
[0,null,null,null,null,null,"","//","//"]
[0,null,null,null,null,null,"","//","//"]
[0,null,null,null,null,null,"","//","//"]
[0,null,null,null,null,null,"","//","//"]
[0,null,null,null,null,null,"","//","//"]
[0,null,null,null,null,null,"","//","//"]
[0,null,null,null,null,null,"","//","//"]
[0,null,null,null,null,null,"","//","//"]
[0,null,null,null,null,null,"","//","//"]
[0,null,null,null,null,null,"","//","//"]
[0,null,null,null,null,null,"","//","//"]
[0,null,null,null,null,null,"","//","//"]
[0,null,null,null,null,null,"","//","//"]
[0,null,null,null,null,null,"","//","//"]
[0,null,null,null,null,null,"","//","//"]
[0,null,null,null,null,null,"","//","//"]
[0,null,null,null,null,null,"","//","//"]
[0,null,null,null,null,null,"","//","//"]
[0,null,null,null,null,null,"","//","//"]
[0,null,null,null,null,null,"","//","//"]
[0,null,null,null,null,null,"","//","//"]
[0,null,null,null,null,null,"","//","//"]
[0,null,null,null,null,null,"","//","//"]
[0,null,null,null,null,null,"","//","//"]
[0,null,null,null,null,null,"","//","//"]
[0,null,null,null,null,null,"","//","//"]
[0,null,null,null,null,null,"","//","//"]
[0,null,null,null,null,null,"","//","//"]
[0,null,null,null,null,null,"","//","//"]
[0,null,null,null,null,null,"","//","//"]
[0,null,null,null,null,null,"","//","//"]
[0,null,null,null,null,null,"","//","//"]
[0,null,null,null,null,null,"","//","//"]
[0,null,null,null,null,null,"","//","//"]
[0,null,null,null,null,null,"","//","//"]
[0,null,null,null,null,null,"","//","//"]
[0,null,null,null,null,null,"","//","//"]
[0,null,null,null,null,null,"","//","//"]
[0,null,null,null,null,null,"","//","//"]
[0,null,null,null,null,null,"","//","//"]
[0,null,null,null,null,null,"","//","//"]
[0,null,null,null,null,null,"","//","//"]
[0,null,null,null,null,null,"","//","//"]
[0,null,null,null,null,null,"","//","//"]
[0,null,null,null,null,null,"","//","//"]
[0,null,null,null,null,null,"","//","//"]
[0,null,null,null,null,null,"","//","//"]
[0,null,null,null,null,null,"","//","//"]
[0,null,null,null,null,null,"","//","//"]
[0,null,null,null,null,null,"",{"$f":"IF(OR($G3328=\"NTSI\",$G3328=\"TTSI\"),$E3328,LEFT($E3328,4)&\"/\"&MID($E3328,5,2)&\"/\"&RIGHT($E3328,2))","v":"//"},{"$f":"IF(OR($G3328=\"NTSI\",$G3328=\"TTSI\"),$F3328,LEFT($F3328,4)&\"/\"&MID($F3328,5,2)&\"/\"&RIGHT($F3328,2))","v":"//"}]
[0,null,null,null,null,null,"","//","//"]
[0,null,null,null,null,null,"","//","//"]
[0,null,null,null,null,null,"","//","//"]
[0,null,null,null,null,null,"","//","//"]
[{"$f":"IF(RIGHT(B3333,1)=\"H\",LEFT(B3333,11)&\"B\",B3333)","v":0},null,null,null,null,null,{"$f":"MID(C3333,4,4)","v":""},"//","//"]
[0,null,null,null,null,null,"","//","//"]
[0,null,null,null,null,null,"","//","//"]
[0,null,null,null,null,null,"","//","//"]
[0,null,null,null,null,null,"","//","//"]
[0,null,null,null,null,null,"","//","//"]
[0,null,null,null,null,null,"","//","//"]
[0,null,null,null,null,null,"","//","//"]
[0,null,null,null,null,null,"","//","//"]
[0,null,null,null,null,null,"","//","//"]
[0,null,null,null,null,null,"","//","//"]
[0,null,null,null,null,null,"","//","//"]
[0,null,null,null,null,null,"","//","//"]
[0,null,null,null,null,null,"","//","//"]
[0,null,null,null,null,null,"","//","//"]
[0,null,null,null,null,null,"","//","//"]
[0,null,null,null,null,null,"","//","//"]
[0,null,null,null,null,null,"","//","//"]
[0,null,null,null,null,null,"","//","//"]
[0,null,null,null,null,null,"","//","//"]
[0,null,null,null,null,null,"","//","//"]
[0,null,null,null,null,null,"","//","//"]
[0,null,null,null,null,null,"","//","//"]
[0,null,null,null,null,null,"","//","//"]
[0,null,null,null,null,null,"","//","//"]
[0,null,null,null,null,null,"","//","//"]
[0,null,null,null,null,null,"","//","//"]
[0,null,null,null,null,null,"","//","//"]
[0,null,null,null,null,null,"","//","//"]
[0,null,null,null,null,null,"","//","//"]
[0,null,null,null,null,null,"","//","//"]
[0,null,null,null,null,null,"","//","//"]
[0,null,null,null,null,null,"","//","//"]
[0,null,null,null,null,null,"","//","//"]
[0,null,null,null,null,null,"","//","//"]
[0,null,null,null,null,null,"","//","//"]
[0,null,null,null,null,null,"","//","//"]
[0,null,null,null,null,null,"","//","//"]
[0,null,null,null,null,null,"","//","//"]
[0,null,null,null,null,null,"","//","//"]
[0,null,null,null,null,null,"","//","//"]
[0,null,null,null,null,null,"","//","//"]
[0,null,null,null,null,null,"","//","//"]
[0,null,null,null,null,null,"","//","//"]
[0,null,null,null,null,null,"","//","//"]
[0,null,null,null,null,null,"","//","//"]
[0,null,null,null,null,null,"","//","//"]
[0,null,null,null,null,null,"","//","//"]
[0,null,null,null,null,null,"","//","//"]
[0,null,null,null,null,null,"","//","//"]
[0,null,null,null,null,null,"","//","//"]
[0,null,null,null,null,null,"","//","//"]
[0,null,null,null,null,null,"","//","//"]
[0,null,null,null,null,null,"","//","//"]
[0,null,null,null,null,null,"","//","//"]
[0,null,null,null,null,null,"","//","//"]
[0,null,null,null,null,null,"","//","//"]
[0,null,null,null,null,null,"","//","//"]
[0,null,null,null,null,null,"","//","//"]
[0,null,null,null,null,null,"",{"$f":"IF(OR($G3392=\"NTSI\",$G3392=\"TTSI\"),$E3392,LEFT($E3392,4)&\"/\"&MID($E3392,5,2)&\"/\"&RIGHT($E3392,2))","v":"//"},{"$f":"IF(OR($G3392=\"NTSI\",$G3392=\"TTSI\"),$F3392,LEFT($F3392,4)&\"/\"&MID($F3392,5,2)&\"/\"&RIGHT($F3392,2))","v":"//"}]
[0,null,null,null,null,null,"","//","//"]
[0,null,null,null,null,null,"","//","//"]
[0,null,null,null,null,null,"","//","//"]
[0,null,null,null,null,null,"","//","//"]
[{"$f":"IF(RIGHT(B3397,1)=\"H\",LEFT(B3397,11)&\"B\",B3397)","v":0},null,null,null,null,null,{"$f":"MID(C3397,4,4)","v":""},"//","//"]
[0,null,null,null,null,null,"","//","//"]
[0,null,null,null,null,null,"","//","//"]
[0,null,null,null,null,null,"","//","//"]
[0,null,null,null,null,null,"","//","//"]
[0,null,null,null,null,null,"","//","//"]
[0,null,null,null,null,null,"","//","//"]
[0,null,null,null,null,null,"","//","//"]
[0,null,null,null,null,null,"","//","//"]
[0,null,null,null,null,null,"","//","//"]
[0,null,null,null,null,null,"","//","//"]
[0,null,null,null,null,null,"","//","//"]
[0,null,null,null,null,null,"","//","//"]
[0,null,null,null,null,null,"","//","//"]
[0,null,null,null,null,null,"","//","//"]
[0,null,null,null,null,null,"","//","//"]
[0,null,null,null,null,null,"","//","//"]
[0,null,null,null,null,null,"","//","//"]
[0,null,null,null,null,null,"","//","//"]
[0,null,null,null,null,null,"","//","//"]
[0,null,null,null,null,null,"","//","//"]
[0,null,null,null,null,null,"","//","//"]
[0,null,null,null,null,null,"","//","//"]
[0,null,null,null,null,null,"","//","//"]
[0,null,null,null,null,null,"","//","//"]
[0,null,null,null,null,null,"","//","//"]
[0,null,null,null,null,null,"","//","//"]
[0,null,null,null,null,null,"","//","//"]
[0,null,null,null,null,null,"","//","//"]
[0,null,null,null,null,null,"","//","//"]
[0,null,null,null,null,null,"","//","//"]
[0,null,null,null,null,null,"","//","//"]
[0,null,null,null,null,null,"","//","//"]
[0,null,null,null,null,null,"","//","//"]
[0,null,null,null,null,null,"","//","//"]
[0,null,null,null,null,null,"","//","//"]
[0,null,null,null,null,null,"","//","//"]
[0,null,null,null,null,null,"","//","//"]
[0,null,null,null,null,null,"","//","//"]
[0,null,null,null,null,null,"","//","//"]
[0,null,null,null,null,null,"","//","//"]
[0,null,null,null,null,null,"","//","//"]
[0,null,null,null,null,null,"","//","//"]
[0,null,null,null,null,null,"","//","//"]
[0,null,null,null,null,null,"","//","//"]
[0,null,null,null,null,null,"","//","//"]
[0,null,null,null,null,null,"","//","//"]
[0,null,null,null,null,null,"","//","//"]
[0,null,null,null,null,null,"","//","//"]
[0,null,null,null,null,null,"","//","//"]
[0,null,null,null,null,null,"","//","//"]
[0,null,null,null,null,null,"","//","//"]
[0,null,null,null,null,null,"","//","//"]
[0,null,null,null,null,null,"","//","//"]
[0,null,null,null,null,null,"","//","//"]
[0,null,null,null,null,null,"","//","//"]
[0,null,null,null,null,null,"","//","//"]
[0,null,null,null,null,null,"","//","//"]
[0,null,null,null,null,null,"","//","//"]
[0,null,null,null,null,null,"",{"$f":"IF(OR($G3456=\"NTSI\",$G3456=\"TTSI\"),$E3456,LEFT($E3456,4)&\"/\"&MID($E3456,5,2)&\"/\"&RIGHT($E3456,2))","v":"//"},{"$f":"IF(OR($G3456=\"NTSI\",$G3456=\"TTSI\"),$F3456,LEFT($F3456,4)&\"/\"&MID($F3456,5,2)&\"/\"&RIGHT($F3456,2))","v":"//"}]
[0,null,null,null,null,null,"","//","//"]
[0,null,null,null,null,null,"","//","//"]
[0,null,null,null,null,null,"","//","//"]
[0,null,null,null,null,null,"","//","//"]
[{"$f":"IF(RIGHT(B3461,1)=\"H\",LEFT(B3461,11)&\"B\",B3461)","v":0},null,null,null,null,null,{"$f":"MID(C3461,4,4)","v":""},"//","//"]
[0,null,null,null,null,null,"","//","//"]
[0,null,null,null,null,null,"","//","//"]
[0,null,null,null,null,null,"","//","//"]
[0,null,null,null,null,null,"","//","//"]
[0,null,null,null,null,null,"","//","//"]
[0,null,null,null,null,null,"","//","//"]
[0,null,null,null,null,null,"","//","//"]
[0,null,null,null,null,null,"","//","//"]
[0,null,null,null,null,null,"","//","//"]
[0,null,null,null,null,null,"","//","//"]
[0,null,null,null,null,null,"","//","//"]
[0,null,null,null,null,null,"","//","//"]
[0,null,null,null,null,null,"","//","//"]
[0,null,null,null,null,null,"","//","//"]
[0,null,null,null,null,null,"","//","//"]
[0,null,null,null,null,null,"","//","//"]
[0,null,null,null,null,null,"","//","//"]
[0,null,null,null,null,null,"","//","//"]
[0,null,null,null,null,null,"","//","//"]
[0,null,null,null,null,null,"","//","//"]
[0,null,null,null,null,null,"","//","//"]
[0,null,null,null,null,null,"","//","//"]
[0,null,null,null,null,null,"","//","//"]
[0,null,null,null,null,null,"","//","//"]
[0,null,null,null,null,null,"","//","//"]
[0,null,null,null,null,null,"","//","//"]
[0,null,null,null,null,null,"","//","//"]
[0,null,null,null,null,null,"","//","//"]
[0,null,null,null,null,null,"","//","//"]
[0,null,null,null,null,null,"","//","//"]
[0,null,null,null,null,null,"","//","//"]
[0,null,null,null,null,null,"","//","//"]
[0,null,null,null,null,null,"","//","//"]
[0,null,null,null,null,null,"","//","//"]
[0,null,null,null,null,null,"","//","//"]
[0,null,null,null,null,null,"","//","//"]
[0,null,null,null,null,null,"","//","//"]
[0,null,null,null,null,null,"","//","//"]
[0,null,null,null,null,null,"","//","//"]
[0,null,null,null,null,null,"","//","//"]
[0,null,null,null,null,null,"","//","//"]
[0,null,null,null,null,null,"","//","//"]
[0,null,null,null,null,null,"","//","//"]
[0,null,null,null,null,null,"","//","//"]
[0,null,null,null,null,null,"","//","//"]
[0,null,null,null,null,null,"","//","//"]
[0,null,null,null,null,null,"","//","//"]
[0,null,null,null,null,null,"","//","//"]
[0,null,null,null,null,null,"","//","//"]
[0,null,null,null,null,null,"","//","//"]
[0,null,null,null,null,null,"","//","//"]
[0,null,null,null,null,null,"","//","//"]
[0,null,null,null,null,null,"","//","//"]
[0,null,null,null,null,null,"","//","//"]
[0,null,null,null,null,null,"","//","//"]
[0,null,null,null,null,null,"","//","//"]
[0,null,null,null,null,null,"","//","//"]
[0,null,null,null,null,null,"","//","//"]
[0,null,null,null,null,null,"",{"$f":"IF(OR($G3520=\"NTSI\",$G3520=\"TTSI\"),$E3520,LEFT($E3520,4)&\"/\"&MID($E3520,5,2)&\"/\"&RIGHT($E3520,2))","v":"//"},{"$f":"IF(OR($G3520=\"NTSI\",$G3520=\"TTSI\"),$F3520,LEFT($F3520,4)&\"/\"&MID($F3520,5,2)&\"/\"&RIGHT($F3520,2))","v":"//"}]
[0,null,null,null,null,null,"","//","//"]
[0,null,null,null,null,null,"","//","//"]
[0,null,null,null,null,null,"","//","//"]
[0,null,null,null,null,null,"","//","//"]
[{"$f":"IF(RIGHT(B3525,1)=\"H\",LEFT(B3525,11)&\"B\",B3525)","v":0},null,null,null,null,null,{"$f":"MID(C3525,4,4)","v":""},"//","//"]
[0,null,null,null,null,null,"","//","//"]
[0,null,null,null,null,null,"","//","//"]
[0,null,null,null,null,null,"","//","//"]
[0,null,null,null,null,null,"","//","//"]
[0,null,null,null,null,null,"","//","//"]
[0,null,null,null,null,null,"","//","//"]
[0,null,null,null,null,null,"","//","//"]
[0,null,null,null,null,null,"","//","//"]
[0,null,null,null,null,null,"","//","//"]
[0,null,null,null,null,null,"","//","//"]
[0,null,null,null,null,null,"","//","//"]
[0,null,null,null,null,null,"","//","//"]
[0,null,null,null,null,null,"","//","//"]
[0,null,null,null,null,null,"","//","//"]
[0,null,null,null,null,null,"","//","//"]
[0,null,null,null,null,null,"","//","//"]
[0,null,null,null,null,null,"","//","//"]
[0,null,null,null,null,null,"","//","//"]
[0,null,null,null,null,null,"","//","//"]
[0,null,null,null,null,null,"","//","//"]
[0,null,null,null,null,null,"","//","//"]
[0,null,null,null,null,null,"","//","//"]
[0,null,null,null,null,null,"","//","//"]
[0,null,null,null,null,null,"","//","//"]
[0,null,null,null,null,null,"","//","//"]
[0,null,null,null,null,null,"","//","//"]
[0,null,null,null,null,null,"","//","//"]
[0,null,null,null,null,null,"","//","//"]
[0,null,null,null,null,null,"","//","//"]
[0,null,null,null,null,null,"","//","//"]
[0,null,null,null,null,null,"","//","//"]
[0,null,null,null,null,null,"","//","//"]
[0,null,null,null,null,null,"","//","//"]
[0,null,null,null,null,null,"","//","//"]
[0,null,null,null,null,null,"","//","//"]
[0,null,null,null,null,null,"","//","//"]
[0,null,null,null,null,null,"","//","//"]
[0,null,null,null,null,null,"","//","//"]
[0,null,null,null,null,null,"","//","//"]
[0,null,null,null,null,null,"","//","//"]
[0,null,null,null,null,null,"","//","//"]
[0,null,null,null,null,null,"","//","//"]
[0,null,null,null,null,null,"","//","//"]
[0,null,null,null,null,null,"","//","//"]
[0,null,null,null,null,null,"","//","//"]
[0,null,null,null,null,null,"","//","//"]
[0,null,null,null,null,null,"","//","//"]
[0,null,null,null,null,null,"","//","//"]
[0,null,null,null,null,null,"","//","//"]
[0,null,null,null,null,null,"","//","//"]
[0,null,null,null,null,null,"","//","//"]
[0,null,null,null,null,null,"","//","//"]
[0,null,null,null,null,null,"","//","//"]
[0,null,null,null,null,null,"","//","//"]
[0,null,null,null,null,null,"","//","//"]
[0,null,null,null,null,null,"","//","//"]
[0,null,null,null,null,null,"","//","//"]
[0,null,null,null,null,null,"","//","//"]
[0,null,null,null,null,null,"",{"$f":"IF(OR($G3584=\"NTSI\",$G3584=\"TTSI\"),$E3584,LEFT($E3584,4)&\"/\"&MID($E3584,5,2)&\"/\"&RIGHT($E3584,2))","v":"//"},{"$f":"IF(OR($G3584=\"NTSI\",$G3584=\"TTSI\"),$F3584,LEFT($F3584,4)&\"/\"&MID($F3584,5,2)&\"/\"&RIGHT($F3584,2))","v":"//"}]
[0,null,null,null,null,null,"","//","//"]
[0,null,null,null,null,null,"","//","//"]
[0,null,null,null,null,null,"","//","//"]
[0,null,null,null,null,null,"","//","//"]
[{"$f":"IF(RIGHT(B3589,1)=\"H\",LEFT(B3589,11)&\"B\",B3589)","v":0},null,null,null,null,null,{"$f":"MID(C3589,4,4)","v":""},"//","//"]
[0,null,null,null,null,null,"","//","//"]
[0,null,null,null,null,null,"","//","//"]
[0,null,null,null,null,null,"","//","//"]
[0,null,null,null,null,null,"","//","//"]
[0,null,null,null,null,null,"","//","//"]
[0,null,null,null,null,null,"","//","//"]
[0,null,null,null,null,null,"","//","//"]
[0,null,null,null,null,null,"","//","//"]
[0,null,null,null,null,null,"","//","//"]
[0,null,null,null,null,null,"","//","//"]
[0,null,null,null,null,null,"","//","//"]
[0,null,null,null,null,null,"","//","//"]
[0,null,null,null,null,null,"","//","//"]
[0,null,null,null,null,null,"","//","//"]
[0,null,null,null,null,null,"","//","//"]
[0,null,null,null,null,null,"","//","//"]
[0,null,null,null,null,null,"","//","//"]
[0,null,null,null,null,null,"","//","//"]
[0,null,null,null,null,null,"","//","//"]
[0,null,null,null,null,null,"","//","//"]
[0,null,null,null,null,null,"","//","//"]
[0,null,null,null,null,null,"","//","//"]
[0,null,null,null,null,null,"","//","//"]
[0,null,null,null,null,null,"","//","//"]
[0,null,null,null,null,null,"","//","//"]
[0,null,null,null,null,null,"","//","//"]
[0,null,null,null,null,null,"","//","//"]
[0,null,null,null,null,null,"","//","//"]
[0,null,null,null,null,null,"","//","//"]
[0,null,null,null,null,null,"","//","//"]
[0,null,null,null,null,null,"","//","//"]
[0,null,null,null,null,null,"","//","//"]
[0,null,null,null,null,null,"","//","//"]
[0,null,null,null,null,null,"","//","//"]
[0,null,null,null,null,null,"","//","//"]
[0,null,null,null,null,null,"","//","//"]
[0,null,null,null,null,null,"","//","//"]
[0,null,null,null,null,null,"","//","//"]
[0,null,null,null,null,null,"","//","//"]
[0,null,null,null,null,null,"","//","//"]
[0,null,null,null,null,null,"","//","//"]
[0,null,null,null,null,null,"","//","//"]
[0,null,null,null,null,null,"","//","//"]
[0,null,null,null,null,null,"","//","//"]
[0,null,null,null,null,null,"","//","//"]
[0,null,null,null,null,null,"","//","//"]
[0,null,null,null,null,null,"","//","//"]
[0,null,null,null,null,null,"","//","//"]
[0,null,null,null,null,null,"","//","//"]
[0,null,null,null,null,null,"","//","//"]
[0,null,null,null,null,null,"","//","//"]
[0,null,null,null,null,null,"","//","//"]
[0,null,null,null,null,null,"","//","//"]
[0,null,null,null,null,null,"","//","//"]
[0,null,null,null,null,null,"","//","//"]
[0,null,null,null,null,null,"","//","//"]
[0,null,null,null,null,null,"","//","//"]
[0,null,null,null,null,null,"","//","//"]
[0,null,null,null,null,null,"",{"$f":"IF(OR($G3648=\"NTSI\",$G3648=\"TTSI\"),$E3648,LEFT($E3648,4)&\"/\"&MID($E3648,5,2)&\"/\"&RIGHT($E3648,2))","v":"//"},{"$f":"IF(OR($G3648=\"NTSI\",$G3648=\"TTSI\"),$F3648,LEFT($F3648,4)&\"/\"&MID($F3648,5,2)&\"/\"&RIGHT($F3648,2))","v":"//"}]
[0,null,null,null,null,null,"","//","//"]
[0,null,null,null,null,null,"","//","//"]
[0,null,null,null,null,null,"","//","//"]
[0,null,null,null,null,null,"","//","//"]
[{"$f":"IF(RIGHT(B3653,1)=\"H\",LEFT(B3653,11)&\"B\",B3653)","v":0},null,null,null,null,null,{"$f":"MID(C3653,4,4)","v":""},"//","//"]
[0,null,null,null,null,null,"","//","//"]
[0,null,null,null,null,null,"","//","//"]
[0,null,null,null,null,null,"","//","//"]
[0,null,null,null,null,null,"","//","//"]
[0,null,null,null,null,null,"","//","//"]
[0,null,null,null,null,null,"","//","//"]
[0,null,null,null,null,null,"","//","//"]
[0,null,null,null,null,null,"","//","//"]
[0,null,null,null,null,null,"","//","//"]
[0,null,null,null,null,null,"","//","//"]
[0,null,null,null,null,null,"","//","//"]
[0,null,null,null,null,null,"","//","//"]
[0,null,null,null,null,null,"","//","//"]
[0,null,null,null,null,null,"","//","//"]
[0,null,null,null,null,null,"","//","//"]
[0,null,null,null,null,null,"","//","//"]
[0,null,null,null,null,null,"","//","//"]
[0,null,null,null,null,null,"","//","//"]
[0,null,null,null,null,null,"","//","//"]
[0,null,null,null,null,null,"","//","//"]
[0,null,null,null,null,null,"","//","//"]
[0,null,null,null,null,null,"","//","//"]
[0,null,null,null,null,null,"","//","//"]
[0,null,null,null,null,null,"","//","//"]
[0,null,null,null,null,null,"","//","//"]
[0,null,null,null,null,null,"","//","//"]
[0,null,null,null,null,null,"","//","//"]
[0,null,null,null,null,null,"","//","//"]
[0,null,null,null,null,null,"","//","//"]
[0,null,null,null,null,null,"","//","//"]
[0,null,null,null,null,null,"","//","//"]
[0,null,null,null,null,null,"","//","//"]
[0,null,null,null,null,null,"","//","//"]
[0,null,null,null,null,null,"","//","//"]
[0,null,null,null,null,null,"","//","//"]
[0,null,null,null,null,null,"","//","//"]
[0,null,null,null,null,null,"","//","//"]
[0,null,null,null,null,null,"","//","//"]
[0,null,null,null,null,null,"","//","//"]
[0,null,null,null,null,null,"","//","//"]
[0,null,null,null,null,null,"","//","//"]
[0,null,null,null,null,null,"","//","//"]
[0,null,null,null,null,null,"","//","//"]
[0,null,null,null,null,null,"","//","//"]
[0,null,null,null,null,null,"","//","//"]
[0,null,null,null,null,null,"","//","//"]
[0,null,null,null,null,null,"","//","//"]
[0,null,null,null,null,null,"","//","//"]
[0,null,null,null,null,null,"","//","//"]
[0,null,null,null,null,null,"","//","//"]
[0,null,null,null,null,null,"","//","//"]
[0,null,null,null,null,null,"","//","//"]
[0,null,null,null,null,null,"","//","//"]
[0,null,null,null,null,null,"","//","//"]
[0,null,null,null,null,null,"","//","//"]
[0,null,null,null,null,null,"","//","//"]
[0,null,null,null,null,null,"","//","//"]
[0,null,null,null,null,null,"","//","//"]
[0,null,null,null,null,null,"",{"$f":"IF(OR($G3712=\"NTSI\",$G3712=\"TTSI\"),$E3712,LEFT($E3712,4)&\"/\"&MID($E3712,5,2)&\"/\"&RIGHT($E3712,2))","v":"//"},{"$f":"IF(OR($G3712=\"NTSI\",$G3712=\"TTSI\"),$F3712,LEFT($F3712,4)&\"/\"&MID($F3712,5,2)&\"/\"&RIGHT($F3712,2))","v":"//"}]
[0,null,null,null,null,null,"","//","//"]
[0,null,null,null,null,null,"","//","//"]
[0,null,null,null,null,null,"","//","//"]
[0,null,null,null,null,null,"","//","//"]
[{"$f":"IF(RIGHT(B3717,1)=\"H\",LEFT(B3717,11)&\"B\",B3717)","v":0},null,null,null,null,null,{"$f":"MID(C3717,4,4)","v":""},"//","//"]
[0,null,null,null,null,null,"","//","//"]
[0,null,null,null,null,null,"","//","//"]
[0,null,null,null,null,null,"","//","//"]
[0,null,null,null,null,null,"","//","//"]
[0,null,null,null,null,null,"","//","//"]
[0,null,null,null,null,null,"","//","//"]
[0,null,null,null,null,null,"","//","//"]
[0,null,null,null,null,null,"","//","//"]
[0,null,null,null,null,null,"","//","//"]
[0,null,null,null,null,null,"","//","//"]
[0,null,null,null,null,null,"","//","//"]
[0,null,null,null,null,null,"","//","//"]
[0,null,null,null,null,null,"","//","//"]
[0,null,null,null,null,null,"","//","//"]
[0,null,null,null,null,null,"","//","//"]
[0,null,null,null,null,null,"","//","//"]
[0,null,null,null,null,null,"","//","//"]
[0,null,null,null,null,null,"","//","//"]
[0,null,null,null,null,null,"","//","//"]
[0,null,null,null,null,null,"","//","//"]
[0,null,null,null,null,null,"","//","//"]
[0,null,null,null,null,null,"","//","//"]
[0,null,null,null,null,null,"","//","//"]
[0,null,null,null,null,null,"","//","//"]
[0,null,null,null,null,null,"","//","//"]
[0,null,null,null,null,null,"","//","//"]
[0,null,null,null,null,null,"","//","//"]
[0,null,null,null,null,null,"","//","//"]
[0,null,null,null,null,null,"","//","//"]
[0,null,null,null,null,null,"","//","//"]
[0,null,null,null,null,null,"","//","//"]
[0,null,null,null,null,null,"","//","//"]
[0,null,null,null,null,null,"","//","//"]
[0,null,null,null,null,null,"","//","//"]
[0,null,null,null,null,null,"","//","//"]
[0,null,null,null,null,null,"","//","//"]
[0,null,null,null,null,null,"","//","//"]
[0,null,null,null,null,null,"","//","//"]
[0,null,null,null,null,null,"","//","//"]
[0,null,null,null,null,null,"","//","//"]
[0,null,null,null,null,null,"","//","//"]
[0,null,null,null,null,null,"","//","//"]
[0,null,null,null,null,null,"","//","//"]
[0,null,null,null,null,null,"","//","//"]
[0,null,null,null,null,null,"","//","//"]
[0,null,null,null,null,null,"","//","//"]
[0,null,null,null,null,null,"","//","//"]
[0,null,null,null,null,null,"","//","//"]
[0,null,null,null,null,null,"","//","//"]
[0,null,null,null,null,null,"","//","//"]
[0,null,null,null,null,null,"","//","//"]
[0,null,null,null,null,null,"","//","//"]
[0,null,null,null,null,null,"","//","//"]
[0,null,null,null,null,null,"","//","//"]
[0,null,null,null,null,null,"","//","//"]
[0,null,null,null,null,null,"","//","//"]
[0,null,null,null,null,null,"","//","//"]
[0,null,null,null,null,null,"","//","//"]
[0,null,null,null,null,null,"",{"$f":"IF(OR($G3776=\"NTSI\",$G3776=\"TTSI\"),$E3776,LEFT($E3776,4)&\"/\"&MID($E3776,5,2)&\"/\"&RIGHT($E3776,2))","v":"//"},{"$f":"IF(OR($G3776=\"NTSI\",$G3776=\"TTSI\"),$F3776,LEFT($F3776,4)&\"/\"&MID($F3776,5,2)&\"/\"&RIGHT($F3776,2))","v":"//"}]
[0,null,null,null,null,null,"","//","//"]
[0,null,null,null,null,null,"","//","//"]
[0,null,null,null,null,null,"","//","//"]
[0,null,null,null,null,null,"","//","//"]
[{"$f":"IF(RIGHT(B3781,1)=\"H\",LEFT(B3781,11)&\"B\",B3781)","v":0},null,null,null,null,null,{"$f":"MID(C3781,4,4)","v":""},"//","//"]
[0,null,null,null,null,null,"","//","//"]
[0,null,null,null,null,null,"","//","//"]
[0,null,null,null,null,null,"","//","//"]
[0,null,null,null,null,null,"","//","//"]
[0,null,null,null,null,null,"","//","//"]
[0,null,null,null,null,null,"","//","//"]
[0,null,null,null,null,null,"","//","//"]
[0,null,null,null,null,null,"","//","//"]
[0,null,null,null,null,null,"","//","//"]
[0,null,null,null,null,null,"","//","//"]
[0,null,null,null,null,null,"","//","//"]
[0,null,null,null,null,null,"","//","//"]
[0,null,null,null,null,null,"","//","//"]
[0,null,null,null,null,null,"","//","//"]
[0,null,null,null,null,null,"","//","//"]
[0,null,null,null,null,null,"","//","//"]
[0,null,null,null,null,null,"","//","//"]
[0,null,null,null,null,null,"","//","//"]
[0,null,null,null,null,null,"","//","//"]
[0,null,null,null,null,null,"","//","//"]
[0,null,null,null,null,null,"","//","//"]
[0,null,null,null,null,null,"","//","//"]
[0,null,null,null,null,null,"","//","//"]
[0,null,null,null,null,null,"","//","//"]
[0,null,null,null,null,null,"","//","//"]
[0,null,null,null,null,null,"","//","//"]
[0,null,null,null,null,null,"","//","//"]
[0,null,null,null,null,null,"","//","//"]
[0,null,null,null,null,null,"","//","//"]
[0,null,null,null,null,null,"","//","//"]
[0,null,null,null,null,null,"","//","//"]
[0,null,null,null,null,null,"","//","//"]
[0,null,null,null,null,null,"","//","//"]
[0,null,null,null,null,null,"","//","//"]
[0,null,null,null,null,null,"","//","//"]
[0,null,null,null,null,null,"","//","//"]
[0,null,null,null,null,null,"","//","//"]
[0,null,null,null,null,null,"","//","//"]
[0,null,null,null,null,null,"","//","//"]
[0,null,null,null,null,null,"","//","//"]
[0,null,null,null,null,null,"","//","//"]
[0,null,null,null,null,null,"","//","//"]
[0,null,null,null,null,null,"","//","//"]
[0,null,null,null,null,null,"","//","//"]
[0,null,null,null,null,null,"","//","//"]
[0,null,null,null,null,null,"","//","//"]
[0,null,null,null,null,null,"","//","//"]
[0,null,null,null,null,null,"","//","//"]
[0,null,null,null,null,null,"","//","//"]
[0,null,null,null,null,null,"","//","//"]
[0,null,null,null,null,null,"","//","//"]
[0,null,null,null,null,null,"","//","//"]
[0,null,null,null,null,null,"","//","//"]
[0,null,null,null,null,null,"","//","//"]
[0,null,null,null,null,null,"","//","//"]
[0,null,null,null,null,null,"","//","//"]
[0,null,null,null,null,null,"","//","//"]
[0,null,null,null,null,null,"","//","//"]
[0,null,null,null,null,null,"",{"$f":"IF(OR($G3840=\"NTSI\",$G3840=\"TTSI\"),$E3840,LEFT($E3840,4)&\"/\"&MID($E3840,5,2)&\"/\"&RIGHT($E3840,2))","v":"//"},{"$f":"IF(OR($G3840=\"NTSI\",$G3840=\"TTSI\"),$F3840,LEFT($F3840,4)&\"/\"&MID($F3840,5,2)&\"/\"&RIGHT($F3840,2))","v":"//"}]
[0,null,null,null,null,null,"","//","//"]
[0,null,null,null,null,null,"","//","//"]
[0,null,null,null,null,null,"","//","//"]
[0,null,null,null,null,null,"","//","//"]
[{"$f":"IF(RIGHT(B3845,1)=\"H\",LEFT(B3845,11)&\"B\",B3845)","v":0},null,null,null,null,null,{"$f":"MID(C3845,4,4)","v":""},"//","//"]
[0,null,null,null,null,null,"","//","//"]
[0,null,null,null,null,null,"","//","//"]
[0,null,null,null,null,null,"","//","//"]
[0,null,null,null,null,null,"","//","//"]
[0,null,null,null,null,null,"","//","//"]
[0,null,null,null,null,null,"","//","//"]
[0,null,null,null,null,null,"","//","//"]
[0,null,null,null,null,null,"","//","//"]
[0,null,null,null,null,null,"","//","//"]
[0,null,null,null,null,null,"","//","//"]
[0,null,null,null,null,null,"","//","//"]
[0,null,null,null,null,null,"","//","//"]
[0,null,null,null,null,null,"","//","//"]
[0,null,null,null,null,null,"","//","//"]
[0,null,null,null,null,null,"","//","//"]
[0,null,null,null,null,null,"","//","//"]
[0,null,null,null,null,null,"","//","//"]
[0,null,null,null,null,null,"","//","//"]
[0,null,null,null,null,null,"","//","//"]
[0,null,null,null,null,null,"","//","//"]
[0,null,null,null,null,null,"","//","//"]
[0,null,null,null,null,null,"","//","//"]
[0,null,null,null,null,null,"","//","//"]
[0,null,null,null,null,null,"","//","//"]
[0,null,null,null,null,null,"","//","//"]
[0,null,null,null,null,null,"","//","//"]
[0,null,null,null,null,null,"","//","//"]
[0,null,null,null,null,null,"","//","//"]
[0,null,null,null,null,null,"","//","//"]
[0,null,null,null,null,null,"","//","//"]
[0,null,null,null,null,null,"","//","//"]
[0,null,null,null,null,null,"","//","//"]
[0,null,null,null,null,null,"","//","//"]
[0,null,null,null,null,null,"","//","//"]
[0,null,null,null,null,null,"","//","//"]
[0,null,null,null,null,null,"","//","//"]
[0,null,null,null,null,null,"","//","//"]
[0,null,null,null,null,null,"","//","//"]
[0,null,null,null,null,null,"","//","//"]
[0,null,null,null,null,null,"","//","//"]
[0,null,null,null,null,null,"","//","//"]
[0,null,null,null,null,null,"","//","//"]
[0,null,null,null,null,null,"","//","//"]
[0,null,null,null,null,null,"","//","//"]
[0,null,null,null,null,null,"","//","//"]
[0,null,null,null,null,null,"","//","//"]
[0,null,null,null,null,null,"","//","//"]
[0,null,null,null,null,null,"","//","//"]
[0,null,null,null,null,null,"","//","//"]
[0,null,null,null,null,null,"","//","//"]
[0,null,null,null,null,null,"","//","//"]
[0,null,null,null,null,null,"","//","//"]
[0,null,null,null,null,null,"","//","//"]
[0,null,null,null,null,null,"","//","//"]
[0,null,null,null,null,null,"","//","//"]
[0,null,null,null,null,null,"","//","//"]
[0,null,null,null,null,null,"","//","//"]
[0,null,null,null,null,null,"","//","//"]
[0,null,null,null,null,null,"",{"$f":"IF(OR($G3904=\"NTSI\",$G3904=\"TTSI\"),$E3904,LEFT($E3904,4)&\"/\"&MID($E3904,5,2)&\"/\"&RIGHT($E3904,2))","v":"//"},{"$f":"IF(OR($G3904=\"NTSI\",$G3904=\"TTSI\"),$F3904,LEFT($F3904,4)&\"/\"&MID($F3904,5,2)&\"/\"&RIGHT($F3904,2))","v":"//"}]
[0,null,null,null,null,null,"","//","//"]
[0,null,null,null,null,null,"","//","//"]
[0,null,null,null,null,null,"","//","//"]
[0,null,null,null,null,null,"","//","//"]
[{"$f":"IF(RIGHT(B3909,1)=\"H\",LEFT(B3909,11)&\"B\",B3909)","v":0},null,null,null,null,null,{"$f":"MID(C3909,4,4)","v":""},"//","//"]
[0,null,null,null,null,null,"","//","//"]
[0,null,null,null,null,null,"","//","//"]
[0,null,null,null,null,null,"","//","//"]
[0,null,null,null,null,null,"","//","//"]
[0,null,null,null,null,null,"","//","//"]
[0,null,null,null,null,null,"","//","//"]
[0,null,null,null,null,null,"","//","//"]
[0,null,null,null,null,null,"","//","//"]
[0,null,null,null,null,null,"","//","//"]
[0,null,null,null,null,null,"","//","//"]
[0,null,null,null,null,null,"","//","//"]
[0,null,null,null,null,null,"","//","//"]
[0,null,null,null,null,null,"","//","//"]
[0,null,null,null,null,null,"","//","//"]
[0,null,null,null,null,null,"","//","//"]
[0,null,null,null,null,null,"","//","//"]
[0,null,null,null,null,null,"","//","//"]
[0,null,null,null,null,null,"","//","//"]
[0,null,null,null,null,null,"","//","//"]
[0,null,null,null,null,null,"","//","//"]
[0,null,null,null,null,null,"","//","//"]
[0,null,null,null,null,null,"","//","//"]
[0,null,null,null,null,null,"","//","//"]
[0,null,null,null,null,null,"","//","//"]
[0,null,null,null,null,null,"","//","//"]
[0,null,null,null,null,null,"","//","//"]
[0,null,null,null,null,null,"","//","//"]
[0,null,null,null,null,null,"","//","//"]
[0,null,null,null,null,null,"","//","//"]
[0,null,null,null,null,null,"","//","//"]
[0,null,null,null,null,null,"","//","//"]
[0,null,null,null,null,null,"","//","//"]
[0,null,null,null,null,null,"","//","//"]
[0,null,null,null,null,null,"","//","//"]
[0,null,null,null,null,null,"","//","//"]
[0,null,null,null,null,null,"","//","//"]
[0,null,null,null,null,null,"","//","//"]
[0,null,null,null,null,null,"","//","//"]
[0,null,null,null,null,null,"","//","//"]
[0,null,null,null,null,null,"","//","//"]
[0,null,null,null,null,null,"","//","//"]
[0,null,null,null,null,null,"","//","//"]
[0,null,null,null,null,null,"","//","//"]
[0,null,null,null,null,null,"","//","//"]
[0,null,null,null,null,null,"","//","//"]
[0,null,null,null,null,null,"","//","//"]
[0,null,null,null,null,null,"","//","//"]
[0,null,null,null,null,null,"","//","//"]
[0,null,null,null,null,null,"","//","//"]
[0,null,null,null,null,null,"","//","//"]
[0,null,null,null,null,null,"","//","//"]
[0,null,null,null,null,null,"","//","//"]
[0,null,null,null,null,null,"","//","//"]
[0,null,null,null,null,null,"","//","//"]
[0,null,null,null,null,null,"","//","//"]
[0,null,null,null,null,null,"","//","//"]
[0,null,null,null,null,null,"","//","//"]
[0,null,null,null,null,null,"","//","//"]
[0,null,null,null,null,null,"",{"$f":"IF(OR($G3968=\"NTSI\",$G3968=\"TTSI\"),$E3968,LEFT($E3968,4)&\"/\"&MID($E3968,5,2)&\"/\"&RIGHT($E3968,2))","v":"//"},{"$f":"IF(OR($G3968=\"NTSI\",$G3968=\"TTSI\"),$F3968,LEFT($F3968,4)&\"/\"&MID($F3968,5,2)&\"/\"&RIGHT($F3968,2))","v":"//"}]
[0,null,null,null,null,null,"","//","//"]
[0,null,null,null,null,null,"","//","//"]
[0,null,null,null,null,null,"","//","//"]
[0,null,null,null,null,null,"","//","//"]
[{"$f":"IF(RIGHT(B3973,1)=\"H\",LEFT(B3973,11)&\"B\",B3973)","v":0},null,null,null,null,null,{"$f":"MID(C3973,4,4)","v":""},"//","//"]
[0,null,null,null,null,null,"","//","//"]
[0,null,null,null,null,null,"","//","//"]
[0,null,null,null,null,null,"","//","//"]
[0,null,null,null,null,null,"","//","//"]
[0,null,null,null,null,null,"","//","//"]
[0,null,null,null,null,null,"","//","//"]
[0,null,null,null,null,null,"","//","//"]
[0,null,null,null,null,null,"","//","//"]
[0,null,null,null,null,null,"","//","//"]
[0,null,null,null,null,null,"","//","//"]
[0,null,null,null,null,null,"","//","//"]
[0,null,null,null,null,null,"","//","//"]
[0,null,null,null,null,null,"","//","//"]
[0,null,null,null,null,null,"","//","//"]
[0,null,null,null,null,null,"","//","//"]
[0,null,null,null,null,null,"","//","//"]
[0,null,null,null,null,null,"","//","//"]
[0,null,null,null,null,null,"","//","//"]
[0,null,null,null,null,null,"","//","//"]
[0,null,null,null,null,null,"","//","//"]
[0,null,null,null,null,null,"","//","//"]
[0,null,null,null,null,null,"","//","//"]
[0,null,null,null,null,null,"","//","//"]
[0,null,null,null,null,null,"","//","//"]
[0,null,null,null,null,null,"","//","//"]
[0,null,null,null,null,null,"","//","//"]
[0,null,null,null,null,null,"","//","//"]
[0,null,null,null,null,null,"","//","//"]
[0,null,null,null,null,null,"","//","//"]
[0,null,null,null,null,null,"","//","//"]
[0,null,null,null,null,null,"","//","//"]
[0,null,null,null,null,null,"","//","//"]
[0,null,null,null,null,null,"","//","//"]
[0,null,null,null,null,null,"","//","//"]
[0,null,null,null,null,null,"","//","//"]
[0,null,null,null,null,null,"","//","//"]
[0,null,null,null,null,null,"","//","//"]
[0,null,null,null,null,null,"","//","//"]
[0,null,null,null,null,null,"","//","//"]
[0,null,null,null,null,null,"","//","//"]
[0,null,null,null,null,null,"","//","//"]
[0,null,null,null,null,null,"","//","//"]
[0,null,null,null,null,null,"","//","//"]
[0,null,null,null,null,null,"","//","//"]
[0,null,null,null,null,null,"","//","//"]
[0,null,null,null,null,null,"","//","//"]
[0,null,null,null,null,null,"","//","//"]
[0,null,null,null,null,null,"","//","//"]
[0,null,null,null,null,null,"","//","//"]
[0,null,null,null,null,null,"","//","//"]
[0,null,null,null,null,null,"","//","//"]
[0,null,null,null,null,null,"","//","//"]
[0,null,null,null,null,null,"","//","//"]
[0,null,null,null,null,null,"","//","//"]
[0,null,null,null,null,null,"","//","//"]
[0,null,null,null,null,null,"","//","//"]
[0,null,null,null,null,null,"","//","//"]
[0,null,null,null,null,null,"","//","//"]
[0,null,null,null,null,null,"",{"$f":"IF(OR($G4032=\"NTSI\",$G4032=\"TTSI\"),$E4032,LEFT($E4032,4)&\"/\"&MID($E4032,5,2)&\"/\"&RIGHT($E4032,2))","v":"//"},{"$f":"IF(OR($G4032=\"NTSI\",$G4032=\"TTSI\"),$F4032,LEFT($F4032,4)&\"/\"&MID($F4032,5,2)&\"/\"&RIGHT($F4032,2))","v":"//"}]
[0,null,null,null,null,null,"","//","//"]
[0,null,null,null,null,null,"","//","//"]
[0,null,null,null,null,null,"","//","//"]
[0,null,null,null,null,null,"","//","//"]
[{"$f":"IF(RIGHT(B4037,1)=\"H\",LEFT(B4037,11)&\"B\",B4037)","v":0},null,null,null,null,null,{"$f":"MID(C4037,4,4)","v":""},"//","//"]
[0,null,null,null,null,null,"","//","//"]
[0,null,null,null,null,null,"","//","//"]
[0,null,null,null,null,null,"","//","//"]
[0,null,null,null,null,null,"","//","//"]
[0,null,null,null,null,null,"","//","//"]
[0,null,null,null,null,null,"","//","//"]
[0,null,null,null,null,null,"","//","//"]
[0,null,null,null,null,null,"","//","//"]
[0,null,null,null,null,null,"","//","//"]
[0,null,null,null,null,null,"","//","//"]
[0,null,null,null,null,null,"","//","//"]
[0,null,null,null,null,null,"","//","//"]
[0,null,null,null,null,null,"","//","//"]
[0,null,null,null,null,null,"","//","//"]
[0,null,null,null,null,null,"","//","//"]
[0,null,null,null,null,null,"","//","//"]
[0,null,null,null,null,null,"","//","//"]
[0,null,null,null,null,null,"","//","//"]
[0,null,null,null,null,null,"","//","//"]
[0,null,null,null,null,null,"","//","//"]
[0,null,null,null,null,null,"","//","//"]
[0,null,null,null,null,null,"","//","//"]
[0,null,null,null,null,null,"","//","//"]
[0,null,null,null,null,null,"","//","//"]
[0,null,null,null,null,null,"","//","//"]
[0,null,null,null,null,null,"","//","//"]
[0,null,null,null,null,null,"","//","//"]
[0,null,null,null,null,null,"","//","//"]
[0,null,null,null,null,null,"","//","//"]
[0,null,null,null,null,null,"","//","//"]
[0,null,null,null,null,null,"","//","//"]
[0,null,null,null,null,null,"","//","//"]
[0,null,null,null,null,null,"","//","//"]
[0,null,null,null,null,null,"","//","//"]
[0,null,null,null,null,null,"","//","//"]
[0,null,null,null,null,null,"","//","//"]
[0,null,null,null,null,null,"","//","//"]
[0,null,null,null,null,null,"","//","//"]
[0,null,null,null,null,null,"","//","//"]
[0,null,null,null,null,null,"","//","//"]
[0,null,null,null,null,null,"","//","//"]
[0,null,null,null,null,null,"","//","//"]
[0,null,null,null,null,null,"","//","//"]
[0,null,null,null,null,null,"","//","//"]
[0,null,null,null,null,null,"","//","//"]
[0,null,null,null,null,null,"","//","//"]
[0,null,null,null,null,null,"","//","//"]
[0,null,null,null,null,null,"","//","//"]
[0,null,null,null,null,null,"","//","//"]
[0,null,null,null,null,null,"","//","//"]
[0,null,null,null,null,null,"","//","//"]
[0,null,null,null,null,null,"","//","//"]
[0,null,null,null,null,null,"","//","//"]
[0,null,null,null,null,null,"","//","//"]
[0,null,null,null,null,null,"","//","//"]
[0,null,null,null,null,null,"","//","//"]
[0,null,null,null,null,null,"","//","//"]
[0,null,null,null,null,null,"","//","//"]
[0,null,null,null,null,null,"",{"$f":"IF(OR($G4096=\"NTSI\",$G4096=\"TTSI\"),$E4096,LEFT($E4096,4)&\"/\"&MID($E4096,5,2)&\"/\"&RIGHT($E4096,2))","v":"//"},{"$f":"IF(OR($G4096=\"NTSI\",$G4096=\"TTSI\"),$F4096,LEFT($F4096,4)&\"/\"&MID($F4096,5,2)&\"/\"&RIGHT($F4096,2))","v":"//"}]
[0,null,null,null,null,null,"","//","//"]
[0,null,null,null,null,null,"","//","//"]
[0,null,null,null,null,null,"","//","//"]
[0,null,null,null,null,null,"","//","//"]
[{"$f":"IF(RIGHT(B4101,1)=\"H\",LEFT(B4101,11)&\"B\",B4101)","v":0},null,null,null,null,null,{"$f":"MID(C4101,4,4)","v":""},"//","//"]
[0,null,null,null,null,null,"","//","//"]
[0,null,null,null,null,null,"","//","//"]
[0,null,null,null,null,null,"","//","//"]
[0,null,null,null,null,null,"","//","//"]
[0,null,null,null,null,null,"","//","//"]
[0,null,null,null,null,null,"","//","//"]
[0,null,null,null,null,null,"","//","//"]
[0,null,null,null,null,null,"","//","//"]
[0,null,null,null,null,null,"","//","//"]
[0,null,null,null,null,null,"","//","//"]
[0,null,null,null,null,null,"","//","//"]
[0,null,null,null,null,null,"","//","//"]
[0,null,null,null,null,null,"","//","//"]
[0,null,null,null,null,null,"","//","//"]
[0,null,null,null,null,null,"","//","//"]
[0,null,null,null,null,null,"","//","//"]
[0,null,null,null,null,null,"","//","//"]
[0,null,null,null,null,null,"","//","//"]
[0,null,null,null,null,null,"","//","//"]
[0,null,null,null,null,null,"","//","//"]
[0,null,null,null,null,null,"","//","//"]
[0,null,null,null,null,null,"","//","//"]
[0,null,null,null,null,null,"","//","//"]
[0,null,null,null,null,null,"","//","//"]
[0,null,null,null,null,null,"","//","//"]
[0,null,null,null,null,null,"","//","//"]
[0,null,null,null,null,null,"","//","//"]
[0,null,null,null,null,null,"","//","//"]
[0,null,null,null,null,null,"","//","//"]
[0,null,null,null,null,null,"","//","//"]
[0,null,null,null,null,null,"","//","//"]
[0,null,null,null,null,null,"","//","//"]
[0,null,null,null,null,null,"","//","//"]
[0,null,null,null,null,null,"","//","//"]
[0,null,null,null,null,null,"","//","//"]
[0,null,null,null,null,null,"","//","//"]
[0,null,null,null,null,null,"","//","//"]
[0,null,null,null,null,null,"","//","//"]
[0,null,null,null,null,null,"","//","//"]
[0,null,null,null,null,null,"","//","//"]
[0,null,null,null,null,null,"","//","//"]
[0,null,null,null,null,null,"","//","//"]
[0,null,null,null,null,null,"","//","//"]
[0,null,null,null,null,null,"","//","//"]
[0,null,null,null,null,null,"","//","//"]
[0,null,null,null,null,null,"","//","//"]
[0,null,null,null,null,null,"","//","//"]
[0,null,null,null,null,null,"","//","//"]
[0,null,null,null,null,null,"","//","//"]
[0,null,null,null,null,null,"","//","//"]
[0,null,null,null,null,null,"","//","//"]
[0,null,null,null,null,null,"","//","//"]
[0,null,null,null,null,null,"","//","//"]
[0,null,null,null,null,null,"","//","//"]
[0,null,null,null,null,null,"","//","//"]
[0,null,null,null,null,null,"","//","//"]
[0,null,null,null,null,null,"","//","//"]
[0,null,null,null,null,null,"","//","//"]
[0,null,null,null,null,null,"",{"$f":"IF(OR($G4160=\"NTSI\",$G4160=\"TTSI\"),$E4160,LEFT($E4160,4)&\"/\"&MID($E4160,5,2)&\"/\"&RIGHT($E4160,2))","v":"//"},{"$f":"IF(OR($G4160=\"NTSI\",$G4160=\"TTSI\"),$F4160,LEFT($F4160,4)&\"/\"&MID($F4160,5,2)&\"/\"&RIGHT($F4160,2))","v":"//"}]
[0,null,null,null,null,null,"","//","//"]
[0,null,null,null,null,null,"","//","//"]
[0,null,null,null,null,null,"","//","//"]
[0,null,null,null,null,null,"","//","//"]
[{"$f":"IF(RIGHT(B4165,1)=\"H\",LEFT(B4165,11)&\"B\",B4165)","v":0},null,null,null,null,null,{"$f":"MID(C4165,4,4)","v":""},"//","//"]
[0,null,null,null,null,null,"","//","//"]
[0,null,null,null,null,null,"","//","//"]
[0,null,null,null,null,null,"","//","//"]
[0,null,null,null,null,null,"","//","//"]
[0,null,null,null,null,null,"","//","//"]
[0,null,null,null,null,null,"","//","//"]
[0,null,null,null,null,null,"","//","//"]
[0,null,null,null,null,null,"","//","//"]
[0,null,null,null,null,null,"","//","//"]
[0,null,null,null,null,null,"","//","//"]
[0,null,null,null,null,null,"","//","//"]
[0,null,null,null,null,null,"","//","//"]
[0,null,null,null,null,null,"","//","//"]
[0,null,null,null,null,null,"","//","//"]
[0,null,null,null,null,null,"","//","//"]
[0,null,null,null,null,null,"","//","//"]
[0,null,null,null,null,null,"","//","//"]
[0,null,null,null,null,null,"","//","//"]
[0,null,null,null,null,null,"","//","//"]
[0,null,null,null,null,null,"","//","//"]
[0,null,null,null,null,null,"","//","//"]
[0,null,null,null,null,null,"","//","//"]
[0,null,null,null,null,null,"","//","//"]
[0,null,null,null,null,null,"","//","//"]
[0,null,null,null,null,null,"","//","//"]
[0,null,null,null,null,null,"","//","//"]
[0,null,null,null,null,null,"","//","//"]
[0,null,null,null,null,null,"","//","//"]
[0,null,null,null,null,null,"","//","//"]
[0,null,null,null,null,null,"","//","//"]
[0,null,null,null,null,null,"","//","//"]
[0,null,null,null,null,null,"","//","//"]
[0,null,null,null,null,null,"","//","//"]
[0,null,null,null,null,null,"","//","//"]
[0,null,null,null,null,null,"","//","//"]
[0,null,null,null,null,null,"","//","//"]
[0,null,null,null,null,null,"","//","//"]
[0,null,null,null,null,null,"","//","//"]
[0,null,null,null,null,null,"","//","//"]
[0,null,null,null,null,null,"","//","//"]
[0,null,null,null,null,null,"","//","//"]
[0,null,null,null,null,null,"","//","//"]
[0,null,null,null,null,null,"","//","//"]
[0,null,null,null,null,null,"","//","//"]
[0,null,null,null,null,null,"","//","//"]
[0,null,null,null,null,null,"","//","//"]
[0,null,null,null,null,null,"","//","//"]
[0,null,null,null,null,null,"","//","//"]
[0,null,null,null,null,null,"","//","//"]
[0,null,null,null,null,null,"","//","//"]
[0,null,null,null,null,null,"","//","//"]
[0,null,null,null,null,null,"","//","//"]
[0,null,null,null,null,null,"","//","//"]
[0,null,null,null,null,null,"","//","//"]
[0,null,null,null,null,null,"","//","//"]
[0,null,null,null,null,null,"","//","//"]
[0,null,null,null,null,null,"","//","//"]
[0,null,null,null,null,null,"","//","//"]
[0,null,null,null,null,null,"",{"$f":"IF(OR($G4224=\"NTSI\",$G4224=\"TTSI\"),$E4224,LEFT($E4224,4)&\"/\"&MID($E4224,5,2)&\"/\"&RIGHT($E4224,2))","v":"//"},{"$f":"IF(OR($G4224=\"NTSI\",$G4224=\"TTSI\"),$F4224,LEFT($F4224,4)&\"/\"&MID($F4224,5,2)&\"/\"&RIGHT($F4224,2))","v":"//"}]
[0,null,null,null,null,null,"","//","//"]
[0,null,null,null,null,null,"","//","//"]
[0,null,null,null,null,null,"","//","//"]
[0,null,null,null,null,null,"","//","//"]
[{"$f":"IF(RIGHT(B4229,1)=\"H\",LEFT(B4229,11)&\"B\",B4229)","v":0},null,null,null,null,null,{"$f":"MID(C4229,4,4)","v":""},"//","//"]
[0,null,null,null,null,null,"","//","//"]
[0,null,null,null,null,null,"","//","//"]
[0,null,null,null,null,null,"","//","//"]
[0,null,null,null,null,null,"","//","//"]
[0,null,null,null,null,null,"","//","//"]
[0,null,null,null,null,null,"","//","//"]
[0,null,null,null,null,null,"","//","//"]
[0,null,null,null,null,null,"","//","//"]
[0,null,null,null,null,null,"","//","//"]
[0,null,null,null,null,null,"","//","//"]
[0,null,null,null,null,null,"","//","//"]
[0,null,null,null,null,null,"","//","//"]
[0,null,null,null,null,null,"","//","//"]
[0,null,null,null,null,null,"","//","//"]
[0,null,null,null,null,null,"","//","//"]
[0,null,null,null,null,null,"","//","//"]
[0,null,null,null,null,null,"","//","//"]
[0,null,null,null,null,null,"","//","//"]
[0,null,null,null,null,null,"","//","//"]
[0,null,null,null,null,null,"","//","//"]
[0,null,null,null,null,null,"","//","//"]
[0,null,null,null,null,null,"","//","//"]
[0,null,null,null,null,null,"","//","//"]
[0,null,null,null,null,null,"","//","//"]
[0,null,null,null,null,null,"","//","//"]
[0,null,null,null,null,null,"","//","//"]
[0,null,null,null,null,null,"","//","//"]
[0,null,null,null,null,null,"","//","//"]
[0,null,null,null,null,null,"","//","//"]
[0,null,null,null,null,null,"","//","//"]
[0,null,null,null,null,null,"","//","//"]
[0,null,null,null,null,null,"","//","//"]
[0,null,null,null,null,null,"","//","//"]
[0,null,null,null,null,null,"","//","//"]
[0,null,null,null,null,null,"","//","//"]
[0,null,null,null,null,null,"","//","//"]
[0,null,null,null,null,null,"","//","//"]
[0,null,null,null,null,null,"","//","//"]
[0,null,null,null,null,null,"","//","//"]
[0,null,null,null,null,null,"","//","//"]
[0,null,null,null,null,null,"","//","//"]
[0,null,null,null,null,null,"","//","//"]
[0,null,null,null,null,null,"","//","//"]
[0,null,null,null,null,null,"","//","//"]
[0,null,null,null,null,null,"","//","//"]
[0,null,null,null,null,null,"","//","//"]
[0,null,null,null,null,null,"","//","//"]
[0,null,null,null,null,null,"","//","//"]
[0,null,null,null,null,null,"","//","//"]
[0,null,null,null,null,null,"","//","//"]
[0,null,null,null,null,null,"","//","//"]
[0,null,null,null,null,null,"","//","//"]
[0,null,null,null,null,null,"","//","//"]
[0,null,null,null,null,null,"","//","//"]
[0,null,null,null,null,null,"","//","//"]
[0,null,null,null,null,null,"","//","//"]
[0,null,null,null,null,null,"","//","//"]
[0,null,null,null,null,null,"","//","//"]
[0,null,null,null,null,null,"",{"$f":"IF(OR($G4288=\"NTSI\",$G4288=\"TTSI\"),$E4288,LEFT($E4288,4)&\"/\"&MID($E4288,5,2)&\"/\"&RIGHT($E4288,2))","v":"//"},{"$f":"IF(OR($G4288=\"NTSI\",$G4288=\"TTSI\"),$F4288,LEFT($F4288,4)&\"/\"&MID($F4288,5,2)&\"/\"&RIGHT($F4288,2))","v":"//"}]
[0,null,null,null,null,null,"","//","//"]
[0,null,null,null,null,null,"","//","//"]
[0,null,null,null,null,null,"","//","//"]
[0,null,null,null,null,null,"","//","//"]
[{"$f":"IF(RIGHT(B4293,1)=\"H\",LEFT(B4293,11)&\"B\",B4293)","v":0},null,null,null,null,null,{"$f":"MID(C4293,4,4)","v":""},"//","//"]
[0,null,null,null,null,null,"","//","//"]
[0,null,null,null,null,null,"","//","//"]
[0,null,null,null,null,null,"","//","//"]
[0,null,null,null,null,null,"","//","//"]
[0,null,null,null,null,null,"","//","//"]
[0,null,null,null,null,null,"","//","//"]
[0,null,null,null,null,null,"","//","//"]
[0,null,null,null,null,null,"","//","//"]
[0,null,null,null,null,null,"","//","//"]
[0,null,null,null,null,null,"","//","//"]
[0,null,null,null,null,null,"","//","//"]
[0,null,null,null,null,null,"","//","//"]
[0,null,null,null,null,null,"","//","//"]
[0,null,null,null,null,null,"","//","//"]
[0,null,null,null,null,null,"","//","//"]
[0,null,null,null,null,null,"","//","//"]
[0,null,null,null,null,null,"","//","//"]
[0,null,null,null,null,null,"","//","//"]
[0,null,null,null,null,null,"","//","//"]
[0,null,null,null,null,null,"","//","//"]
[0,null,null,null,null,null,"","//","//"]
[0,null,null,null,null,null,"","//","//"]
[0,null,null,null,null,null,"","//","//"]
[0,null,null,null,null,null,"","//","//"]
[0,null,null,null,null,null,"","//","//"]
[0,null,null,null,null,null,"","//","//"]
[0,null,null,null,null,null,"","//","//"]
[0,null,null,null,null,null,"","//","//"]
[0,null,null,null,null,null,"","//","//"]
[0,null,null,null,null,null,"","//","//"]
[0,null,null,null,null,null,"","//","//"]
[0,null,null,null,null,null,"","//","//"]
[0,null,null,null,null,null,"","//","//"]
[0,null,null,null,null,null,"","//","//"]
[0,null,null,null,null,null,"","//","//"]
[0,null,null,null,null,null,"","//","//"]
[0,null,null,null,null,null,"","//","//"]
[0,null,null,null,null,null,"","//","//"]
[0,null,null,null,null,null,"","//","//"]
[0,null,null,null,null,null,"","//","//"]
[0,null,null,null,null,null,"","//","//"]
[0,null,null,null,null,null,"","//","//"]
[0,null,null,null,null,null,"","//","//"]
[0,null,null,null,null,null,"","//","//"]
[0,null,null,null,null,null,"","//","//"]
[0,null,null,null,null,null,"","//","//"]
[0,null,null,null,null,null,"","//","//"]
[0,null,null,null,null,null,"","//","//"]
[0,null,null,null,null,null,"","//","//"]
[0,null,null,null,null,null,"","//","//"]
[0,null,null,null,null,null,"","//","//"]
[0,null,null,null,null,null,"","//","//"]
[0,null,null,null,null,null,"","//","//"]
[0,null,null,null,null,null,"","//","//"]
[0,null,null,null,null,null,"","//","//"]
[0,null,null,null,null,null,"","//","//"]
[0,null,null,null,null,null,"","//","//"]
[0,null,null,null,null,null,"","//","//"]
[0,null,null,null,null,null,"",{"$f":"IF(OR($G4352=\"NTSI\",$G4352=\"TTSI\"),$E4352,LEFT($E4352,4)&\"/\"&MID($E4352,5,2)&\"/\"&RIGHT($E4352,2))","v":"//"},{"$f":"IF(OR($G4352=\"NTSI\",$G4352=\"TTSI\"),$F4352,LEFT($F4352,4)&\"/\"&MID($F4352,5,2)&\"/\"&RIGHT($F4352,2))","v":"//"}]
[0,null,null,null,null,null,"","//","//"]
[0,null,null,null,null,null,"","//","//"]
[0,null,null,null,null,null,"","//","//"]
[0,null,null,null,null,null,"","//","//"]
[{"$f":"IF(RIGHT(B4357,1)=\"H\",LEFT(B4357,11)&\"B\",B4357)","v":0},null,null,null,null,null,{"$f":"MID(C4357,4,4)","v":""},"//","//"]
[0,null,null,null,null,null,"","//","//"]
[0,null,null,null,null,null,"","//","//"]
[0,null,null,null,null,null,"","//","//"]
[0,null,null,null,null,null,"","//","//"]
[0,null,null,null,null,null,"","//","//"]
[0,null,null,null,null,null,"","//","//"]
[0,null,null,null,null,null,"","//","//"]
[0,null,null,null,null,null,"","//","//"]
[0,null,null,null,null,null,"","//","//"]
[0,null,null,null,null,null,"","//","//"]
[0,null,null,null,null,null,"","//","//"]
[0,null,null,null,null,null,"","//","//"]
[0,null,null,null,null,null,"","//","//"]
[0,null,null,null,null,null,"","//","//"]
[0,null,null,null,null,null,"","//","//"]
[0,null,null,null,null,null,"","//","//"]
[0,null,null,null,null,null,"","//","//"]
[0,null,null,null,null,null,"","//","//"]
[0,null,null,null,null,null,"","//","//"]
[0,null,null,null,null,null,"","//","//"]
[0,null,null,null,null,null,"","//","//"]
[0,null,null,null,null,null,"","//","//"]
[0,null,null,null,null,null,"","//","//"]
[0,null,null,null,null,null,"","//","//"]
[0,null,null,null,null,null,"","//","//"]
[0,null,null,null,null,null,"","//","//"]
[0,null,null,null,null,null,"","//","//"]
[0,null,null,null,null,null,"","//","//"]
[0,null,null,null,null,null,"","//","//"]
[0,null,null,null,null,null,"","//","//"]
[0,null,null,null,null,null,"","//","//"]
[0,null,null,null,null,null,"","//","//"]
[0,null,null,null,null,null,"","//","//"]
[0,null,null,null,null,null,"","//","//"]
[0,null,null,null,null,null,"","//","//"]
[0,null,null,null,null,null,"","//","//"]
[0,null,null,null,null,null,"","//","//"]
[0,null,null,null,null,null,"","//","//"]
[0,null,null,null,null,null,"","//","//"]
[0,null,null,null,null,null,"","//","//"]
[0,null,null,null,null,null,"","//","//"]
[0,null,null,null,null,null,"","//","//"]
[0,null,null,null,null,null,"","//","//"]
[0,null,null,null,null,null,"","//","//"]
[0,null,null,null,null,null,"","//","//"]
[0,null,null,null,null,null,"","//","//"]
[0,null,null,null,null,null,"","//","//"]
[0,null,null,null,null,null,"","//","//"]
[0,null,null,null,null,null,"","//","//"]
[0,null,null,null,null,null,"","//","//"]
[0,null,null,null,null,null,"","//","//"]
[0,null,null,null,null,null,"","//","//"]
[0,null,null,null,null,null,"","//","//"]
[0,null,null,null,null,null,"","//","//"]
[0,null,null,null,null,null,"","//","//"]
[0,null,null,null,null,null,"","//","//"]
[0,null,null,null,null,null,"","//","//"]
[0,null,null,null,null,null,"","//","//"]
[0,null,null,null,null,null,"",{"$f":"IF(OR($G4416=\"NTSI\",$G4416=\"TTSI\"),$E4416,LEFT($E4416,4)&\"/\"&MID($E4416,5,2)&\"/\"&RIGHT($E4416,2))","v":"//"},{"$f":"IF(OR($G4416=\"NTSI\",$G4416=\"TTSI\"),$F4416,LEFT($F4416,4)&\"/\"&MID($F4416,5,2)&\"/\"&RIGHT($F4416,2))","v":"//"}]
[0,null,null,null,null,null,"","//","//"]
[0,null,null,null,null,null,"","//","//"]
[0,null,null,null,null,null,"","//","//"]
[0,null,null,null,null,null,"","//","//"]
[{"$f":"IF(RIGHT(B4421,1)=\"H\",LEFT(B4421,11)&\"B\",B4421)","v":0},null,null,null,null,null,{"$f":"MID(C4421,4,4)","v":""},"//","//"]
[0,null,null,null,null,null,"","//","//"]
[0,null,null,null,null,null,"","//","//"]
[0,null,null,null,null,null,"","//","//"]
[0,null,null,null,null,null,"","//","//"]
[0,null,null,null,null,null,"","//","//"]
[0,null,null,null,null,null,"","//","//"]
[0,null,null,null,null,null,"","//","//"]
[0,null,null,null,null,null,"","//","//"]
[0,null,null,null,null,null,"","//","//"]
[0,null,null,null,null,null,"","//","//"]
[0,null,null,null,null,null,"","//","//"]
[0,null,null,null,null,null,"","//","//"]
[0,null,null,null,null,null,"","//","//"]
[0,null,null,null,null,null,"","//","//"]
[0,null,null,null,null,null,"","//","//"]
[0,null,null,null,null,null,"","//","//"]
[0,null,null,null,null,null,"","//","//"]
[0,null,null,null,null,null,"","//","//"]
[0,null,null,null,null,null,"","//","//"]
[0,null,null,null,null,null,"","//","//"]
[0,null,null,null,null,null,"","//","//"]
[0,null,null,null,null,null,"","//","//"]
[0,null,null,null,null,null,"","//","//"]
[0,null,null,null,null,null,"","//","//"]
[0,null,null,null,null,null,"","//","//"]
[0,null,null,null,null,null,"","//","//"]
[0,null,null,null,null,null,"","//","//"]
[0,null,null,null,null,null,"","//","//"]
[0,null,null,null,null,null,"","//","//"]
[0,null,null,null,null,null,"","//","//"]
[0,null,null,null,null,null,"","//","//"]
[0,null,null,null,null,null,"","//","//"]
[0,null,null,null,null,null,"","//","//"]
[0,null,null,null,null,null,"","//","//"]
[0,null,null,null,null,null,"","//","//"]
[0,null,null,null,null,null,"","//","//"]
[0,null,null,null,null,null,"","//","//"]
[0,null,null,null,null,null,"","//","//"]
[0,null,null,null,null,null,"","//","//"]
[0,null,null,null,null,null,"","//","//"]
[0,null,null,null,null,null,"","//","//"]
[0,null,null,null,null,null,"","//","//"]
[0,null,null,null,null,null,"","//","//"]
[0,null,null,null,null,null,"","//","//"]
[0,null,null,null,null,null,"","//","//"]
[0,null,null,null,null,null,"","//","//"]
[0,null,null,null,null,null,"","//","//"]
[0,null,null,null,null,null,"","//","//"]
[0,null,null,null,null,null,"","//","//"]
[0,null,null,null,null,null,"","//","//"]
[0,null,null,null,null,null,"","//","//"]
[0,null,null,null,null,null,"","//","//"]
[0,null,null,null,null,null,"","//","//"]
[0,null,null,null,null,null,"","//","//"]
[0,null,null,null,null,null,"","//","//"]
[0,null,null,null,null,null,"","//","//"]
[0,null,null,null,null,null,"","//","//"]
[0,null,null,null,null,null,"","//","//"]
[0,null,null,null,null,null,"",{"$f":"IF(OR($G4480=\"NTSI\",$G4480=\"TTSI\"),$E4480,LEFT($E4480,4)&\"/\"&MID($E4480,5,2)&\"/\"&RIGHT($E4480,2))","v":"//"},{"$f":"IF(OR($G4480=\"NTSI\",$G4480=\"TTSI\"),$F4480,LEFT($F4480,4)&\"/\"&MID($F4480,5,2)&\"/\"&RIGHT($F4480,2))","v":"//"}]
[0,null,null,null,null,null,"","//","//"]
[0,null,null,null,null,null,"","//","//"]
[0,null,null,null,null,null,"","//","//"]
[0,null,null,null,null,null,"","//","//"]
[{"$f":"IF(RIGHT(B4485,1)=\"H\",LEFT(B4485,11)&\"B\",B4485)","v":0},null,null,null,null,null,{"$f":"MID(C4485,4,4)","v":""},"//","//"]
[0,null,null,null,null,null,"","//","//"]
[0,null,null,null,null,null,"","//","//"]
[0,null,null,null,null,null,"","//","//"]
[0,null,null,null,null,null,"","//","//"]
[0,null,null,null,null,null,"","//","//"]
[0,null,null,null,null,null,"","//","//"]
[0,null,null,null,null,null,"","//","//"]
[0,null,null,null,null,null,"","//","//"]
[0,null,null,null,null,null,"","//","//"]
[0,null,null,null,null,null,"","//","//"]
[0,null,null,null,null,null,"","//","//"]
[0,null,null,null,null,null,"","//","//"]
[0,null,null,null,null,null,"","//","//"]
[0,null,null,null,null,null,"","//","//"]
[0,null,null,null,null,null,"","//","//"]
[0,null,null,null,null,null,"","//","//"]
[0,null,null,null,null,null,"","//","//"]
[0,null,null,null,null,null,"","//","//"]
[0,null,null,null,null,null,"","//","//"]
[0,null,null,null,null,null,"","//","//"]
[0,null,null,null,null,null,"","//","//"]
[0,null,null,null,null,null,"","//","//"]
[0,null,null,null,null,null,"","//","//"]
[0,null,null,null,null,null,"","//","//"]
[0,null,null,null,null,null,"","//","//"]
[0,null,null,null,null,null,"","//","//"]
[0,null,null,null,null,null,"","//","//"]
[0,null,null,null,null,null,"","//","//"]
[0,null,null,null,null,null,"","//","//"]
[0,null,null,null,null,null,"","//","//"]
[0,null,null,null,null,null,"","//","//"]
[0,null,null,null,null,null,"","//","//"]
[0,null,null,null,null,null,"","//","//"]
[0,null,null,null,null,null,"","//","//"]
[0,null,null,null,null,null,"","//","//"]
[0,null,null,null,null,null,"","//","//"]
[0,null,null,null,null,null,"","//","//"]
[0,null,null,null,null,null,"","//","//"]
[0,null,null,null,null,null,"","//","//"]
[0,null,null,null,null,null,"","//","//"]
[0,null,null,null,null,null,"","//","//"]
[0,null,null,null,null,null,"","//","//"]
[0,null,null,null,null,null,"","//","//"]
[0,null,null,null,null,null,"","//","//"]
[0,null,null,null,null,null,"","//","//"]
[0,null,null,null,null,null,"","//","//"]
[0,null,null,null,null,null,"","//","//"]
[0,null,null,null,null,null,"","//","//"]
[0,null,null,null,null,null,"","//","//"]
[0,null,null,null,null,null,"","//","//"]
[0,null,null,null,null,null,"","//","//"]
[0,null,null,null,null,null,"","//","//"]
[0,null,null,null,null,null,"","//","//"]
[0,null,null,null,null,null,"","//","//"]
[0,null,null,null,null,null,"","//","//"]
[0,null,null,null,null,null,"","//","//"]
[0,null,null,null,null,null,"","//","//"]
[0,null,null,null,null,null,"","//","//"]
[0,null,null,null,null,null,"",{"$f":"IF(OR($G4544=\"NTSI\",$G4544=\"TTSI\"),$E4544,LEFT($E4544,4)&\"/\"&MID($E4544,5,2)&\"/\"&RIGHT($E4544,2))","v":"//"},{"$f":"IF(OR($G4544=\"NTSI\",$G4544=\"TTSI\"),$F4544,LEFT($F4544,4)&\"/\"&MID($F4544,5,2)&\"/\"&RIGHT($F4544,2))","v":"//"}]
[0,null,null,null,null,null,"","//","//"]
[0,null,null,null,null,null,"","//","//"]
[0,null,null,null,null,null,"","//","//"]
[0,null,null,null,null,null,"","//","//"]
[{"$f":"IF(RIGHT(B4549,1)=\"H\",LEFT(B4549,11)&\"B\",B4549)","v":0},null,null,null,null,null,{"$f":"MID(C4549,4,4)","v":""},"//","//"]
[0,null,null,null,null,null,"","//","//"]
[0,null,null,null,null,null,"","//","//"]
[0,null,null,null,null,null,"","//","//"]
[0,null,null,null,null,null,"","//","//"]
[0,null,null,null,null,null,"","//","//"]
[0,null,null,null,null,null,"","//","//"]
[0,null,null,null,null,null,"","//","//"]
[0,null,null,null,null,null,"","//","//"]
[0,null,null,null,null,null,"","//","//"]
[0,null,null,null,null,null,"","//","//"]
[0,null,null,null,null,null,"","//","//"]
[0,null,null,null,null,null,"","//","//"]
[0,null,null,null,null,null,"","//","//"]
[0,null,null,null,null,null,"","//","//"]
[0,null,null,null,null,null,"","//","//"]
[0,null,null,null,null,null,"","//","//"]
[0,null,null,null,null,null,"","//","//"]
[0,null,null,null,null,null,"","//","//"]
[0,null,null,null,null,null,"","//","//"]
[0,null,null,null,null,null,"","//","//"]
[0,null,null,null,null,null,"","//","//"]
[0,null,null,null,null,null,"","//","//"]
[0,null,null,null,null,null,"","//","//"]
[0,null,null,null,null,null,"","//","//"]
[0,null,null,null,null,null,"","//","//"]
[0,null,null,null,null,null,"","//","//"]
[0,null,null,null,null,null,"","//","//"]
[0,null,null,null,null,null,"","//","//"]
[0,null,null,null,null,null,"","//","//"]
[0,null,null,null,null,null,"","//","//"]
[0,null,null,null,null,null,"","//","//"]
[0,null,null,null,null,null,"","//","//"]
[0,null,null,null,null,null,"","//","//"]
[0,null,null,null,null,null,"","//","//"]
[0,null,null,null,null,null,"","//","//"]
[0,null,null,null,null,null,"","//","//"]
[0,null,null,null,null,null,"","//","//"]
[0,null,null,null,null,null,"","//","//"]
[0,null,null,null,null,null,"","//","//"]
[0,null,null,null,null,null,"","//","//"]
[0,null,null,null,null,null,"","//","//"]
[0,null,null,null,null,null,"","//","//"]
[0,null,null,null,null,null,"","//","//"]
[0,null,null,null,null,null,"","//","//"]
[0,null,null,null,null,null,"","//","//"]
[0,null,null,null,null,null,"","//","//"]
[0,null,null,null,null,null,"","//","//"]
[0,null,null,null,null,null,"","//","//"]
[0,null,null,null,null,null,"","//","//"]
[0,null,null,null,null,null,"","//","//"]
[0,null,null,null,null,null,"","//","//"]
[0,null,null,null,null,null,"","//","//"]
[0,null,null,null,null,null,"","//","//"]
[0,null,null,null,null,null,"","//","//"]
[0,null,null,null,null,null,"","//","//"]
[0,null,null,null,null,null,"","//","//"]
[0,null,null,null,null,null,"","//","//"]
[0,null,null,null,null,null,"","//","//"]
[0,null,null,null,null,null,"",{"$f":"IF(OR($G4608=\"NTSI\",$G4608=\"TTSI\"),$E4608,LEFT($E4608,4)&\"/\"&MID($E4608,5,2)&\"/\"&RIGHT($E4608,2))","v":"//"},{"$f":"IF(OR($G4608=\"NTSI\",$G4608=\"TTSI\"),$F4608,LEFT($F4608,4)&\"/\"&MID($F4608,5,2)&\"/\"&RIGHT($F4608,2))","v":"//"}]
[0,null,null,null,null,null,"","//","//"]
[0,null,null,null,null,null,"","//","//"]
[0,null,null,null,null,null,"","//","//"]
[0,null,null,null,null,null,"","//","//"]
[{"$f":"IF(RIGHT(B4613,1)=\"H\",LEFT(B4613,11)&\"B\",B4613)","v":0},null,null,null,null,null,{"$f":"MID(C4613,4,4)","v":""},"//","//"]
[0,null,null,null,null,null,"","//","//"]
[0,null,null,null,null,null,"","//","//"]
[0,null,null,null,null,null,"","//","//"]
[0,null,null,null,null,null,"","//","//"]
[0,null,null,null,null,null,"","//","//"]
[0,null,null,null,null,null,"","//","//"]
[0,null,null,null,null,null,"","//","//"]
[0,null,null,null,null,null,"","//","//"]
[0,null,null,null,null,null,"","//","//"]
[0,null,null,null,null,null,"","//","//"]
[0,null,null,null,null,null,"","//","//"]
[0,null,null,null,null,null,"","//","//"]
[0,null,null,null,null,null,"","//","//"]
[0,null,null,null,null,null,"","//","//"]
[0,null,null,null,null,null,"","//","//"]
[0,null,null,null,null,null,"","//","//"]
[0,null,null,null,null,null,"","//","//"]
[0,null,null,null,null,null,"","//","//"]
[0,null,null,null,null,null,"","//","//"]
[0,null,null,null,null,null,"","//","//"]
[0,null,null,null,null,null,"","//","//"]
[0,null,null,null,null,null,"","//","//"]
[0,null,null,null,null,null,"","//","//"]
[0,null,null,null,null,null,"","//","//"]
[0,null,null,null,null,null,"","//","//"]
[0,null,null,null,null,null,"","//","//"]
[0,null,null,null,null,null,"","//","//"]
[0,null,null,null,null,null,"","//","//"]
[0,null,null,null,null,null,"","//","//"]
[0,null,null,null,null,null,"","//","//"]
[0,null,null,null,null,null,"","//","//"]
[0,null,null,null,null,null,"","//","//"]
[0,null,null,null,null,null,"","//","//"]
[0,null,null,null,null,null,"","//","//"]
[0,null,null,null,null,null,"","//","//"]
[0,null,null,null,null,null,"","//","//"]
[0,null,null,null,null,null,"","//","//"]
[0,null,null,null,null,null,"","//","//"]
[0,null,null,null,null,null,"","//","//"]
[0,null,null,null,null,null,"","//","//"]
[0,null,null,null,null,null,"","//","//"]
[0,null,null,null,null,null,"","//","//"]
[0,null,null,null,null,null,"","//","//"]
[0,null,null,null,null,null,"","//","//"]
[0,null,null,null,null,null,"","//","//"]
[0,null,null,null,null,null,"","//","//"]
[0,null,null,null,null,null,"","//","//"]
[0,null,null,null,null,null,"","//","//"]
[0,null,null,null,null,null,"","//","//"]
[0,null,null,null,null,null,"","//","//"]
[0,null,null,null,null,null,"","//","//"]
[0,null,null,null,null,null,"","//","//"]
[0,null,null,null,null,null,"","//","//"]
[0,null,null,null,null,null,"","//","//"]
[0,null,null,null,null,null,"","//","//"]
[0,null,null,null,null,null,"","//","//"]
[0,null,null,null,null,null,"","//","//"]
[0,null,null,null,null,null,"","//","//"]
[0,null,null,null,null,null,"",{"$f":"IF(OR($G4672=\"NTSI\",$G4672=\"TTSI\"),$E4672,LEFT($E4672,4)&\"/\"&MID($E4672,5,2)&\"/\"&RIGHT($E4672,2))","v":"//"},{"$f":"IF(OR($G4672=\"NTSI\",$G4672=\"TTSI\"),$F4672,LEFT($F4672,4)&\"/\"&MID($F4672,5,2)&\"/\"&RIGHT($F4672,2))","v":"//"}]
[0,null,null,null,null,null,"","//","//"]
[0,null,null,null,null,null,"","//","//"]
[0,null,null,null,null,null,"","//","//"]
[0,null,null,null,null,null,"","//","//"]
[{"$f":"IF(RIGHT(B4677,1)=\"H\",LEFT(B4677,11)&\"B\",B4677)","v":0},null,null,null,null,null,{"$f":"MID(C4677,4,4)","v":""},"//","//"]
[0,null,null,null,null,null,"","//","//"]
[0,null,null,null,null,null,"","//","//"]
[0,null,null,null,null,null,"","//","//"]
[0,null,null,null,null,null,"","//","//"]
[0,null,null,null,null,null,"","//","//"]
[0,null,null,null,null,null,"","//","//"]
[0,null,null,null,null,null,"","//","//"]
[0,null,null,null,null,null,"","//","//"]
[0,null,null,null,null,null,"","//","//"]
[0,null,null,null,null,null,"","//","//"]
[0,null,null,null,null,null,"","//","//"]
[0,null,null,null,null,null,"","//","//"]
[0,null,null,null,null,null,"","//","//"]
[0,null,null,null,null,null,"","//","//"]
[0,null,null,null,null,null,"","//","//"]
[0,null,null,null,null,null,"","//","//"]
[0,null,null,null,null,null,"","//","//"]
[0,null,null,null,null,null,"","//","//"]
[0,null,null,null,null,null,"","//","//"]
[0,null,null,null,null,null,"","//","//"]
[0,null,null,null,null,null,"","//","//"]
[0,null,null,null,null,null,"","//","//"]
[0,null,null,null,null,null,"","//","//"]
[0,null,null,null,null,null,"","//","//"]
[0,null,null,null,null,null,"","//","//"]
[0,null,null,null,null,null,"","//","//"]
[0,null,null,null,null,null,"","//","//"]
[0,null,null,null,null,null,"","//","//"]
[0,null,null,null,null,null,"","//","//"]
[0,null,null,null,null,null,"","//","//"]
[0,null,null,null,null,null,"","//","//"]
[0,null,null,null,null,null,"","//","//"]
[0,null,null,null,null,null,"","//","//"]
[0,null,null,null,null,null,"","//","//"]
[0,null,null,null,null,null,"","//","//"]
[0,null,null,null,null,null,"","//","//"]
[0,null,null,null,null,null,"","//","//"]
[0,null,null,null,null,null,"","//","//"]
[0,null,null,null,null,null,"","//","//"]
[0,null,null,null,null,null,"","//","//"]
[0,null,null,null,null,null,"","//","//"]
[0,null,null,null,null,null,"","//","//"]
[0,null,null,null,null,null,"","//","//"]
[0,null,null,null,null,null,"","//","//"]
[0,null,null,null,null,null,"","//","//"]
[0,null,null,null,null,null,"","//","//"]
[0,null,null,null,null,null,"","//","//"]
[0,null,null,null,null,null,"","//","//"]
[0,null,null,null,null,null,"","//","//"]
[0,null,null,null,null,null,"","//","//"]
[0,null,null,null,null,null,"","//","//"]
[0,null,null,null,null,null,"","//","//"]
[0,null,null,null,null,null,"","//","//"]
[0,null,null,null,null,null,"","//","//"]
[0,null,null,null,null,null,"","//","//"]
[0,null,null,null,null,null,"","//","//"]
[0,null,null,null,null,null,"","//","//"]
[0,null,null,null,null,null,"","//","//"]
[0,null,null,null,null,null,"",{"$f":"IF(OR($G4736=\"NTSI\",$G4736=\"TTSI\"),$E4736,LEFT($E4736,4)&\"/\"&MID($E4736,5,2)&\"/\"&RIGHT($E4736,2))","v":"//"},{"$f":"IF(OR($G4736=\"NTSI\",$G4736=\"TTSI\"),$F4736,LEFT($F4736,4)&\"/\"&MID($F4736,5,2)&\"/\"&RIGHT($F4736,2))","v":"//"}]
[0,null,null,null,null,null,"","//","//"]
[0,null,null,null,null,null,"","//","//"]
[0,null,null,null,null,null,"","//","//"]
[0,null,null,null,null,null,"","//","//"]
[{"$f":"IF(RIGHT(B4741,1)=\"H\",LEFT(B4741,11)&\"B\",B4741)","v":0},null,null,null,null,null,{"$f":"MID(C4741,4,4)","v":""},"//","//"]
[0,null,null,null,null,null,"","//","//"]
[0,null,null,null,null,null,"","//","//"]
[0,null,null,null,null,null,"","//","//"]
[0,null,null,null,null,null,"","//","//"]
[0,null,null,null,null,null,"","//","//"]
[0,null,null,null,null,null,"","//","//"]
[0,null,null,null,null,null,"","//","//"]
[0,null,null,null,null,null,"","//","//"]
[0,null,null,null,null,null,"","//","//"]
[0,null,null,null,null,null,"","//","//"]
[0,null,null,null,null,null,"","//","//"]
[0,null,null,null,null,null,"","//","//"]
[0,null,null,null,null,null,"","//","//"]
[0,null,null,null,null,null,"","//","//"]
[0,null,null,null,null,null,"","//","//"]
[0,null,null,null,null,null,"","//","//"]
[0,null,null,null,null,null,"","//","//"]
[0,null,null,null,null,null,"","//","//"]
[0,null,null,null,null,null,"","//","//"]
[0,null,null,null,null,null,"","//","//"]
[0,null,null,null,null,null,"","//","//"]
[0,null,null,null,null,null,"","//","//"]
[0,null,null,null,null,null,"","//","//"]
[0,null,null,null,null,null,"","//","//"]
[0,null,null,null,null,null,"","//","//"]
[0,null,null,null,null,null,"","//","//"]
[0,null,null,null,null,null,"","//","//"]
[0,null,null,null,null,null,"","//","//"]
[0,null,null,null,null,null,"","//","//"]
[0,null,null,null,null,null,"","//","//"]
[0,null,null,null,null,null,"","//","//"]
[0,null,null,null,null,null,"","//","//"]
[0,null,null,null,null,null,"","//","//"]
[0,null,null,null,null,null,"","//","//"]
[0,null,null,null,null,null,"","//","//"]
[0,null,null,null,null,null,"","//","//"]
[0,null,null,null,null,null,"","//","//"]
[0,null,null,null,null,null,"","//","//"]
[0,null,null,null,null,null,"","//","//"]
[0,null,null,null,null,null,"","//","//"]
[0,null,null,null,null,null,"","//","//"]
[0,null,null,null,null,null,"","//","//"]
[0,null,null,null,null,null,"","//","//"]
[0,null,null,null,null,null,"","//","//"]
[0,null,null,null,null,null,"","//","//"]
[0,null,null,null,null,null,"","//","//"]
[0,null,null,null,null,null,"","//","//"]
[0,null,null,null,null,null,"","//","//"]
[0,null,null,null,null,null,"","//","//"]
[0,null,null,null,null,null,"","//","//"]
[0,null,null,null,null,null,"","//","//"]
[0,null,null,null,null,null,"","//","//"]
[0,null,null,null,null,null,"","//","//"]
[0,null,null,null,null,null,"","//","//"]
[0,null,null,null,null,null,"","//","//"]
[0,null,null,null,null,null,"","//","//"]
[0,null,null,null,null,null,"","//","//"]
[0,null,null,null,null,null,"","//","//"]
[0,null,null,null,null,null,"",{"$f":"IF(OR($G4800=\"NTSI\",$G4800=\"TTSI\"),$E4800,LEFT($E4800,4)&\"/\"&MID($E4800,5,2)&\"/\"&RIGHT($E4800,2))","v":"//"},{"$f":"IF(OR($G4800=\"NTSI\",$G4800=\"TTSI\"),$F4800,LEFT($F4800,4)&\"/\"&MID($F4800,5,2)&\"/\"&RIGHT($F4800,2))","v":"//"}]
[0,null,null,null,null,null,"","//","//"]
[0,null,null,null,null,null,"","//","//"]
[0,null,null,null,null,null,"","//","//"]
[0,null,null,null,null,null,"","//","//"]
[{"$f":"IF(RIGHT(B4805,1)=\"H\",LEFT(B4805,11)&\"B\",B4805)","v":0},null,null,null,null,null,{"$f":"MID(C4805,4,4)","v":""},"//","//"]
[0,null,null,null,null,null,"","//","//"]
[0,null,null,null,null,null,"","//","//"]
[0,null,null,null,null,null,"","//","//"]
[0,null,null,null,null,null,"","//","//"]
[0,null,null,null,null,null,"","//","//"]
[0,null,null,null,null,null,"","//","//"]
[0,null,null,null,null,null,"","//","//"]
[0,null,null,null,null,null,"","//","//"]
[0,null,null,null,null,null,"","//","//"]
[0,null,null,null,null,null,"","//","//"]
[0,null,null,null,null,null,"","//","//"]
[0,null,null,null,null,null,"","//","//"]
[0,null,null,null,null,null,"","//","//"]
[0,null,null,null,null,null,"","//","//"]
[0,null,null,null,null,null,"","//","//"]
[0,null,null,null,null,null,"","//","//"]
[0,null,null,null,null,null,"","//","//"]
[0,null,null,null,null,null,"","//","//"]
[0,null,null,null,null,null,"","//","//"]
[0,null,null,null,null,null,"","//","//"]
[0,null,null,null,null,null,"","//","//"]
[0,null,null,null,null,null,"","//","//"]
[0,null,null,null,null,null,"","//","//"]
[0,null,null,null,null,null,"","//","//"]
[0,null,null,null,null,null,"","//","//"]
[0,null,null,null,null,null,"","//","//"]
[0,null,null,null,null,null,"","//","//"]
[0,null,null,null,null,null,"","//","//"]
[0,null,null,null,null,null,"","//","//"]
[0,null,null,null,null,null,"","//","//"]
[0,null,null,null,null,null,"","//","//"]
[0,null,null,null,null,null,"","//","//"]
[0,null,null,null,null,null,"","//","//"]
[0,null,null,null,null,null,"","//","//"]
[0,null,null,null,null,null,"","//","//"]
[0,null,null,null,null,null,"","//","//"]
[0,null,null,null,null,null,"","//","//"]
[0,null,null,null,null,null,"","//","//"]
[0,null,null,null,null,null,"","//","//"]
[0,null,null,null,null,null,"","//","//"]
[0,null,null,null,null,null,"","//","//"]
[0,null,null,null,null,null,"","//","//"]
[0,null,null,null,null,null,"","//","//"]
[0,null,null,null,null,null,"","//","//"]
[0,null,null,null,null,null,"","//","//"]
[0,null,null,null,null,null,"","//","//"]
[0,null,null,null,null,null,"","//","//"]
[0,null,null,null,null,null,"","//","//"]
[0,null,null,null,null,null,"","//","//"]
[0,null,null,null,null,null,"","//","//"]
[0,null,null,null,null,null,"","//","//"]
[0,null,null,null,null,null,"","//","//"]
[0,null,null,null,null,null,"","//","//"]
[0,null,null,null,null,null,"","//","//"]
[0,null,null,null,null,null,"","//","//"]
[0,null,null,null,null,null,"","//","//"]
[0,null,null,null,null,null,"","//","//"]
[0,null,null,null,null,null,"","//","//"]
[0,null,null,null,null,null,"",{"$f":"IF(OR($G4864=\"NTSI\",$G4864=\"TTSI\"),$E4864,LEFT($E4864,4)&\"/\"&MID($E4864,5,2)&\"/\"&RIGHT($E4864,2))","v":"//"},{"$f":"IF(OR($G4864=\"NTSI\",$G4864=\"TTSI\"),$F4864,LEFT($F4864,4)&\"/\"&MID($F4864,5,2)&\"/\"&RIGHT($F4864,2))","v":"//"}]
[0,null,null,null,null,null,"","//","//"]
[0,null,null,null,null,null,"","//","//"]
[0,null,null,null,null,null,"","//","//"]
[0,null,null,null,null,null,"","//","//"]
[{"$f":"IF(RIGHT(B4869,1)=\"H\",LEFT(B4869,11)&\"B\",B4869)","v":0},null,null,null,null,null,{"$f":"MID(C4869,4,4)","v":""},"//","//"]
[0,null,null,null,null,null,"","//","//"]
[0,null,null,null,null,null,"","//","//"]
[0,null,null,null,null,null,"","//","//"]
[0,null,null,null,null,null,"","//","//"]
[0,null,null,null,null,null,"","//","//"]
[0,null,null,null,null,null,"","//","//"]
[0,null,null,null,null,null,"","//","//"]
[0,null,null,null,null,null,"","//","//"]
[0,null,null,null,null,null,"","//","//"]
[0,null,null,null,null,null,"","//","//"]
[0,null,null,null,null,null,"","//","//"]
[0,null,null,null,null,null,"","//","//"]
[0,null,null,null,null,null,"","//","//"]
[0,null,null,null,null,null,"","//","//"]
[0,null,null,null,null,null,"","//","//"]
[0,null,null,null,null,null,"","//","//"]
[0,null,null,null,null,null,"","//","//"]
[0,null,null,null,null,null,"","//","//"]
[0,null,null,null,null,null,"","//","//"]
[0,null,null,null,null,null,"","//","//"]
[0,null,null,null,null,null,"","//","//"]
[0,null,null,null,null,null,"","//","//"]
[0,null,null,null,null,null,"","//","//"]
[0,null,null,null,null,null,"","//","//"]
[0,null,null,null,null,null,"","//","//"]
[0,null,null,null,null,null,"","//","//"]
[0,null,null,null,null,null,"","//","//"]
[0,null,null,null,null,null,"","//","//"]
[0,null,null,null,null,null,"","//","//"]
[0,null,null,null,null,null,"","//","//"]
[0,null,null,null,null,null,"","//","//"]
[0,null,null,null,null,null,"","//","//"]
[0,null,null,null,null,null,"","//","//"]
[0,null,null,null,null,null,"","//","//"]
[0,null,null,null,null,null,"","//","//"]
[0,null,null,null,null,null,"","//","//"]
[0,null,null,null,null,null,"","//","//"]
[0,null,null,null,null,null,"","//","//"]
[0,null,null,null,null,null,"","//","//"]
[0,null,null,null,null,null,"","//","//"]
[0,null,null,null,null,null,"","//","//"]
[0,null,null,null,null,null,"","//","//"]
[0,null,null,null,null,null,"","//","//"]
[0,null,null,null,null,null,"","//","//"]
[0,null,null,null,null,null,"","//","//"]
[0,null,null,null,null,null,"","//","//"]
[0,null,null,null,null,null,"","//","//"]
[0,null,null,null,null,null,"","//","//"]
[0,null,null,null,null,null,"","//","//"]
[0,null,null,null,null,null,"","//","//"]
[0,null,null,null,null,null,"","//","//"]
[0,null,null,null,null,null,"","//","//"]
[0,null,null,null,null,null,"","//","//"]
[0,null,null,null,null,null,"","//","//"]
[0,null,null,null,null,null,"","//","//"]
[0,null,null,null,null,null,"","//","//"]
[0,null,null,null,null,null,"","//","//"]
[0,null,null,null,null,null,"","//","//"]
[0,null,null,null,null,null,"",{"$f":"IF(OR($G4928=\"NTSI\",$G4928=\"TTSI\"),$E4928,LEFT($E4928,4)&\"/\"&MID($E4928,5,2)&\"/\"&RIGHT($E4928,2))","v":"//"},{"$f":"IF(OR($G4928=\"NTSI\",$G4928=\"TTSI\"),$F4928,LEFT($F4928,4)&\"/\"&MID($F4928,5,2)&\"/\"&RIGHT($F4928,2))","v":"//"}]
[0,null,null,null,null,null,"","//","//"]
[0,null,null,null,null,null,"","//","//"]
[0,null,null,null,null,null,"","//","//"]
[0,null,null,null,null,null,"","//","//"]
[{"$f":"IF(RIGHT(B4933,1)=\"H\",LEFT(B4933,11)&\"B\",B4933)","v":0},null,null,null,null,null,{"$f":"MID(C4933,4,4)","v":""},"//","//"]
[0,null,null,null,null,null,"","//","//"]
[0,null,null,null,null,null,"","//","//"]
[0,null,null,null,null,null,"","//","//"]
[0,null,null,null,null,null,"","//","//"]
[0,null,null,null,null,null,"","//","//"]
[0,null,null,null,null,null,"","//","//"]
[0,null,null,null,null,null,"","//","//"]
[0,null,null,null,null,null,"","//","//"]
[0,null,null,null,null,null,"","//","//"]
[0,null,null,null,null,null,"","//","//"]
[0,null,null,null,null,null,"","//","//"]
[0,null,null,null,null,null,"","//","//"]
[0,null,null,null,null,null,"","//","//"]
[0,null,null,null,null,null,"","//","//"]
[0,null,null,null,null,null,"","//","//"]
[0,null,null,null,null,null,"","//","//"]
[0,null,null,null,null,null,"","//","//"]
[0,null,null,null,null,null,"","//","//"]
[0,null,null,null,null,null,"","//","//"]
[0,null,null,null,null,null,"","//","//"]
[0,null,null,null,null,null,"","//","//"]
[0,null,null,null,null,null,"","//","//"]
[0,null,null,null,null,null,"","//","//"]
[0,null,null,null,null,null,"","//","//"]
[0,null,null,null,null,null,"","//","//"]
[0,null,null,null,null,null,"","//","//"]
[0,null,null,null,null,null,"","//","//"]
[0,null,null,null,null,null,"","//","//"]
[0,null,null,null,null,null,"","//","//"]
[0,null,null,null,null,null,"","//","//"]
[0,null,null,null,null,null,"","//","//"]
[0,null,null,null,null,null,"","//","//"]
[0,null,null,null,null,null,"","//","//"]
[0,null,null,null,null,null,"","//","//"]
[0,null,null,null,null,null,"","//","//"]
[0,null,null,null,null,null,"","//","//"]
[0,null,null,null,null,null,"","//","//"]
[0,null,null,null,null,null,"","//","//"]
[0,null,null,null,null,null,"","//","//"]
[0,null,null,null,null,null,"","//","//"]
[0,null,null,null,null,null,"","//","//"]
[0,null,null,null,null,null,"","//","//"]
[0,null,null,null,null,null,"","//","//"]
[0,null,null,null,null,null,"","//","//"]
[0,null,null,null,null,null,"","//","//"]
[0,null,null,null,null,null,"","//","//"]
[0,null,null,null,null,null,"","//","//"]
[0,null,null,null,null,null,"","//","//"]
[0,null,null,null,null,null,"","//","//"]
[0,null,null,null,null,null,"","//","//"]
[0,null,null,null,null,null,"","//","//"]
[0,null,null,null,null,null,"","//","//"]
[0,null,null,null,null,null,"","//","//"]
[0,null,null,null,null,null,"","//","//"]
[0,null,null,null,null,null,"","//","//"]
[0,null,null,null,null,null,"","//","//"]
[0,null,null,null,null,null,"","//","//"]
[0,null,null,null,null,null,"","//","//"]
[0,null,null,null,null,null,"",{"$f":"IF(OR($G4992=\"NTSI\",$G4992=\"TTSI\"),$E4992,LEFT($E4992,4)&\"/\"&MID($E4992,5,2)&\"/\"&RIGHT($E4992,2))","v":"//"},{"$f":"IF(OR($G4992=\"NTSI\",$G4992=\"TTSI\"),$F4992,LEFT($F4992,4)&\"/\"&MID($F4992,5,2)&\"/\"&RIGHT($F4992,2))","v":"//"}]
[0,null,null,null,null,null,"","//","//"]
[0,null,null,null,null,null,"","//","//"]
[0,null,null,null,null,null,"","//","//"]
[0,null,null,null,null,null,"","//","//"]
[{"$f":"IF(RIGHT(B4997,1)=\"H\",LEFT(B4997,11)&\"B\",B4997)","v":0},null,null,null,null,null,{"$f":"MID(C4997,4,4)","v":""},"//","//"]
[0,null,null,null,null,null,"","//","//"]
[0,null,null,null,null,null,"","//","//"]
[0,null,null,null,null,null,"","//","//"]
[0,null,null,null,null,null,"","//","//"]
[0,null,null,null,null,null,"","//","//"]
[0,null,null,null,null,null,"","//","//"]
[0,null,null,null,null,null,"","//","//"]
[0,null,null,null,null,null,"","//","//"]
[0,null,null,null,null,null,"","//","//"]
[0,null,null,null,null,null,"","//","//"]
[0,null,null,null,null,null,"","//","//"]
[0,null,null,null,null,null,"","//","//"]
[0,null,null,null,null,null,"","//","//"]
[0,null,null,null,null,null,"","//","//"]
[0,null,null,null,null,null,"","//","//"]
[0,null,null,null,null,null,"","//","//"]
[0,null,null,null,null,null,"","//","//"]
[0,null,null,null,null,null,"","//","//"]
[0,null,null,null,null,null,"","//","//"]
[0,null,null,null,null,null,"","//","//"]
[0,null,null,null,null,null,"","//","//"]
[0,null,null,null,null,null,"","//","//"]
[0,null,null,null,null,null,"","//","//"]
[0,null,null,null,null,null,"","//","//"]
[0,null,null,null,null,null,"","//","//"]
[0,null,null,null,null,null,"","//","//"]
[0,null,null,null,null,null,"","//","//"]
[0,null,null,null,null,null,"","//","//"]
[0,null,null,null,null,null,"","//","//"]
[0,null,null,null,null,null,"","//","//"]
[0,null,null,null,null,null,"","//","//"]
[0,null,null,null,null,null,"","//","//"]
[0,null,null,null,null,null,"","//","//"]
[0,null,null,null,null,null,"","//","//"]
[0,null,null,null,null,null,"","//","//"]
[0,null,null,null,null,null,"","//","//"]
[0,null,null,null,null,null,"","//","//"]
[0,null,null,null,null,null,"","//","//"]
[0,null,null,null,null,null,"","//","//"]
[0,null,null,null,null,null,"","//","//"]
[0,null,null,null,null,null,"","//","//"]
[0,null,null,null,null,null,"","//","//"]
[0,null,null,null,null,null,"","//","//"]
[0,null,null,null,null,null,"","//","//"]
[0,null,null,null,null,null,"","//","//"]
[0,null,null,null,null,null,"","//","//"]
[0,null,null,null,null,null,"","//","//"]
[0,null,null,null,null,null,"","//","//"]
[0,null,null,null,null,null,"","//","//"]
[0,null,null,null,null,null,"","//","//"]
[0,null,null,null,null,null,"","//","//"]
[0,null,null,null,null,null,"","//","//"]
[0,null,null,null,null,null,"","//","//"]
[0,null,null,null,null,null,"","//","//"]
[0,null,null,null,null,null,"","//","//"]
[0,null,null,null,null,null,"","//","//"]
[0,null,null,null,null,null,"","//","//"]
[0,null,null,null,null,null,"","//","//"]
[0,null,null,null,null,null,"",{"$f":"IF(OR($G5056=\"NTSI\",$G5056=\"TTSI\"),$E5056,LEFT($E5056,4)&\"/\"&MID($E5056,5,2)&\"/\"&RIGHT($E5056,2))","v":"//"},{"$f":"IF(OR($G5056=\"NTSI\",$G5056=\"TTSI\"),$F5056,LEFT($F5056,4)&\"/\"&MID($F5056,5,2)&\"/\"&RIGHT($F5056,2))","v":"//"}]
[0,null,null,null,null,null,"","//","//"]
[0,null,null,null,null,null,"","//","//"]
[0,null,null,null,null,null,"","//","//"]
[0,null,null,null,null,null,"","//","//"]
[{"$f":"IF(RIGHT(B5061,1)=\"H\",LEFT(B5061,11)&\"B\",B5061)","v":0},null,null,null,null,null,{"$f":"MID(C5061,4,4)","v":""},"//","//"]
[0,null,null,null,null,null,"","//","//"]
[0,null,null,null,null,null,"","//","//"]
[0,null,null,null,null,null,"","//","//"]
[0,null,null,null,null,null,"","//","//"]
[0,null,null,null,null,null,"","//","//"]
[0,null,null,null,null,null,"","//","//"]
[0,null,null,null,null,null,"","//","//"]
[0,null,null,null,null,null,"","//","//"]
[0,null,null,null,null,null,"","//","//"]
[0,null,null,null,null,null,"","//","//"]
[0,null,null,null,null,null,"","//","//"]
[0,null,null,null,null,null,"","//","//"]
[0,null,null,null,null,null,"","//","//"]
[0,null,null,null,null,null,"","//","//"]
[0,null,null,null,null,null,"","//","//"]
[0,null,null,null,null,null,"","//","//"]
[0,null,null,null,null,null,"","//","//"]
[0,null,null,null,null,null,"","//","//"]
[0,null,null,null,null,null,"","//","//"]
[0,null,null,null,null,null,"","//","//"]
[0,null,null,null,null,null,"","//","//"]
[0,null,null,null,null,null,"","//","//"]
[0,null,null,null,null,null,"","//","//"]
[0,null,null,null,null,null,"","//","//"]
[0,null,null,null,null,null,"","//","//"]
[0,null,null,null,null,null,"","//","//"]
[0,null,null,null,null,null,"","//","//"]
[0,null,null,null,null,null,"","//","//"]
[0,null,null,null,null,null,"","//","//"]
[0,null,null,null,null,null,"","//","//"]
[0,null,null,null,null,null,"","//","//"]
[0,null,null,null,null,null,"","//","//"]
[0,null,null,null,null,null,"","//","//"]
[0,null,null,null,null,null,"","//","//"]
[0,null,null,null,null,null,"","//","//"]
[0,null,null,null,null,null,"","//","//"]
[0,null,null,null,null,null,"","//","//"]
[0,null,null,null,null,null,"","//","//"]
[0,null,null,null,null,null,"","//","//"]
[0,null,null,null,null,null,"","//","//"]
[0,null,null,null,null,null,"","//","//"]
[0,null,null,null,null,null,"","//","//"]
[0,null,null,null,null,null,"","//","//"]
[0,null,null,null,null,null,"","//","//"]
[0,null,null,null,null,null,"","//","//"]
[0,null,null,null,null,null,"","//","//"]
[0,null,null,null,null,null,"","//","//"]
[0,null,null,null,null,null,"","//","//"]
[0,null,null,null,null,null,"","//","//"]
[0,null,null,null,null,null,"","//","//"]
[0,null,null,null,null,null,"","//","//"]
[0,null,null,null,null,null,"","//","//"]
[0,null,null,null,null,null,"","//","//"]
[0,null,null,null,null,null,"","//","//"]
[0,null,null,null,null,null,"","//","//"]
[0,null,null,null,null,null,"","//","//"]
[0,null,null,null,null,null,"","//","//"]
[0,null,null,null,null,null,"","//","//"]
[0,null,null,null,null,null,"",{"$f":"IF(OR($G5120=\"NTSI\",$G5120=\"TTSI\"),$E5120,LEFT($E5120,4)&\"/\"&MID($E5120,5,2)&\"/\"&RIGHT($E5120,2))","v":"//"},{"$f":"IF(OR($G5120=\"NTSI\",$G5120=\"TTSI\"),$F5120,LEFT($F5120,4)&\"/\"&MID($F5120,5,2)&\"/\"&RIGHT($F5120,2))","v":"//"}]
[0,null,null,null,null,null,"","//","//"]
[0,null,null,null,null,null,"","//","//"]
[0,null,null,null,null,null,"","//","//"]
[0,null,null,null,null,null,"","//","//"]
[{"$f":"IF(RIGHT(B5125,1)=\"H\",LEFT(B5125,11)&\"B\",B5125)","v":0},null,null,null,null,null,{"$f":"MID(C5125,4,4)","v":""},"//","//"]
[0,null,null,null,null,null,"","//","//"]
[0,null,null,null,null,null,"","//","//"]
[0,null,null,null,null,null,"","//","//"]
[0,null,null,null,null,null,"","//","//"]
[0,null,null,null,null,null,"","//","//"]
[0,null,null,null,null,null,"","//","//"]
[0,null,null,null,null,null,"","//","//"]
[0,null,null,null,null,null,"","//","//"]
[0,null,null,null,null,null,"","//","//"]
[0,null,null,null,null,null,"","//","//"]
[0,null,null,null,null,null,"","//","//"]
[0,null,null,null,null,null,"","//","//"]
[0,null,null,null,null,null,"","//","//"]
[0,null,null,null,null,null,"","//","//"]
[0,null,null,null,null,null,"","//","//"]
[0,null,null,null,null,null,"","//","//"]
[0,null,null,null,null,null,"","//","//"]
[0,null,null,null,null,null,"","//","//"]
[0,null,null,null,null,null,"","//","//"]
[0,null,null,null,null,null,"","//","//"]
[0,null,null,null,null,null,"","//","//"]
[0,null,null,null,null,null,"","//","//"]
[0,null,null,null,null,null,"","//","//"]
[0,null,null,null,null,null,"","//","//"]
[0,null,null,null,null,null,"","//","//"]
[0,null,null,null,null,null,"","//","//"]
[0,null,null,null,null,null,"","//","//"]
[0,null,null,null,null,null,"","//","//"]
[0,null,null,null,null,null,"","//","//"]
[0,null,null,null,null,null,"","//","//"]
[0,null,null,null,null,null,"","//","//"]
[0,null,null,null,null,null,"","//","//"]
[0,null,null,null,null,null,"","//","//"]
[0,null,null,null,null,null,"","//","//"]
[0,null,null,null,null,null,"","//","//"]
[0,null,null,null,null,null,"","//","//"]
[0,null,null,null,null,null,"","//","//"]
[0,null,null,null,null,null,"","//","//"]
[0,null,null,null,null,null,"","//","//"]
[0,null,null,null,null,null,"","//","//"]
[0,null,null,null,null,null,"","//","//"]
[0,null,null,null,null,null,"","//","//"]
[0,null,null,null,null,null,"","//","//"]
[0,null,null,null,null,null,"","//","//"]
[0,null,null,null,null,null,"","//","//"]
[0,null,null,null,null,null,"","//","//"]
[0,null,null,null,null,null,"","//","//"]
[0,null,null,null,null,null,"","//","//"]
[0,null,null,null,null,null,"","//","//"]
[0,null,null,null,null,null,"","//","//"]
[0,null,null,null,null,null,"","//","//"]
[0,null,null,null,null,null,"","//","//"]
[0,null,null,null,null,null,"","//","//"]
[0,null,null,null,null,null,"","//","//"]
[0,null,null,null,null,null,"","//","//"]
[0,null,null,null,null,null,"","//","//"]
[0,null,null,null,null,null,"","//","//"]
[0,null,null,null,null,null,"","//","//"]
[0,null,null,null,null,null,"",{"$f":"IF(OR($G5184=\"NTSI\",$G5184=\"TTSI\"),$E5184,LEFT($E5184,4)&\"/\"&MID($E5184,5,2)&\"/\"&RIGHT($E5184,2))","v":"//"},{"$f":"IF(OR($G5184=\"NTSI\",$G5184=\"TTSI\"),$F5184,LEFT($F5184,4)&\"/\"&MID($F5184,5,2)&\"/\"&RIGHT($F5184,2))","v":"//"}]
[0,null,null,null,null,null,"","//","//"]
[0,null,null,null,null,null,"","//","//"]
[0,null,null,null,null,null,"","//","//"]
[0,null,null,null,null,null,"","//","//"]
[{"$f":"IF(RIGHT(B5189,1)=\"H\",LEFT(B5189,11)&\"B\",B5189)","v":0},null,null,null,null,null,{"$f":"MID(C5189,4,4)","v":""},"//","//"]
[0,null,null,null,null,null,"","//","//"]
[0,null,null,null,null,null,"","//","//"]
[0,null,null,null,null,null,"","//","//"]
[0,null,null,null,null,null,"","//","//"]
[0,null,null,null,null,null,"","//","//"]
[0,null,null,null,null,null,"","//","//"]
[0,null,null,null,null,null,"","//","//"]
[0,null,null,null,null,null,"","//","//"]
[0,null,null,null,null,null,"","//","//"]
[0,null,null,null,null,null,"","//","//"]
[0,null,null,null,null,null,"","//","//"]
[0,null,null,null,null,null,"","//","//"]
[0,null,null,null,null,null,"","//","//"]
[0,null,null,null,null,null,"","//","//"]
[0,null,null,null,null,null,"","//","//"]
[0,null,null,null,null,null,"","//","//"]
[0,null,null,null,null,null,"","//","//"]
[0,null,null,null,null,null,"","//","//"]
[0,null,null,null,null,null,"","//","//"]
[0,null,null,null,null,null,"","//","//"]
[0,null,null,null,null,null,"","//","//"]
[0,null,null,null,null,null,"","//","//"]
[0,null,null,null,null,null,"","//","//"]
[0,null,null,null,null,null,"","//","//"]
[0,null,null,null,null,null,"","//","//"]
[0,null,null,null,null,null,"","//","//"]
[0,null,null,null,null,null,"","//","//"]
[0,null,null,null,null,null,"","//","//"]
[0,null,null,null,null,null,"","//","//"]
[0,null,null,null,null,null,"","//","//"]
[0,null,null,null,null,null,"","//","//"]
[0,null,null,null,null,null,"","//","//"]
[0,null,null,null,null,null,"","//","//"]
[0,null,null,null,null,null,"","//","//"]
[0,null,null,null,null,null,"","//","//"]
[0,null,null,null,null,null,"","//","//"]
[0,null,null,null,null,null,"","//","//"]
[0,null,null,null,null,null,"","//","//"]
[0,null,null,null,null,null,"","//","//"]
[0,null,null,null,null,null,"","//","//"]
[0,null,null,null,null,null,"","//","//"]
[0,null,null,null,null,null,"","//","//"]
[0,null,null,null,null,null,"","//","//"]
[0,null,null,null,null,null,"","//","//"]
[0,null,null,null,null,null,"","//","//"]
[0,null,null,null,null,null,"","//","//"]
[0,null,null,null,null,null,"","//","//"]
[0,null,null,null,null,null,"","//","//"]
[0,null,null,null,null,null,"","//","//"]
[0,null,null,null,null,null,"","//","//"]
[0,null,null,null,null,null,"","//","//"]
[0,null,null,null,null,null,"","//","//"]
[0,null,null,null,null,null,"","//","//"]
[0,null,null,null,null,null,"","//","//"]
[0,null,null,null,null,null,"","//","//"]
[0,null,null,null,null,null,"","//","//"]
[0,null,null,null,null,null,"","//","//"]
[0,null,null,null,null,null,"","//","//"]
[0,null,null,null,null,null,"",{"$f":"IF(OR($G5248=\"NTSI\",$G5248=\"TTSI\"),$E5248,LEFT($E5248,4)&\"/\"&MID($E5248,5,2)&\"/\"&RIGHT($E5248,2))","v":"//"},{"$f":"IF(OR($G5248=\"NTSI\",$G5248=\"TTSI\"),$F5248,LEFT($F5248,4)&\"/\"&MID($F5248,5,2)&\"/\"&RIGHT($F5248,2))","v":"//"}]
[0,null,null,null,null,null,"","//","//"]
[0,null,null,null,null,null,"","//","//"]
[0,null,null,null,null,null,"","//","//"]
[0,null,null,null,null,null,"","//","//"]
[{"$f":"IF(RIGHT(B5253,1)=\"H\",LEFT(B5253,11)&\"B\",B5253)","v":0},null,null,null,null,null,{"$f":"MID(C5253,4,4)","v":""},"//","//"]
[0,null,null,null,null,null,"","//","//"]
[0,null,null,null,null,null,"","//","//"]
[0,null,null,null,null,null,"","//","//"]
[0,null,null,null,null,null,"","//","//"]
[0,null,null,null,null,null,"","//","//"]
[0,null,null,null,null,null,"","//","//"]
[0,null,null,null,null,null,"","//","//"]
[0,null,null,null,null,null,"","//","//"]
[0,null,null,null,null,null,"","//","//"]
[0,null,null,null,null,null,"","//","//"]
[0,null,null,null,null,null,"","//","//"]
[0,null,null,null,null,null,"","//","//"]
[0,null,null,null,null,null,"","//","//"]
[0,null,null,null,null,null,"","//","//"]
[0,null,null,null,null,null,"","//","//"]
[0,null,null,null,null,null,"","//","//"]
[0,null,null,null,null,null,"","//","//"]
[0,null,null,null,null,null,"","//","//"]
[0,null,null,null,null,null,"","//","//"]
[0,null,null,null,null,null,"","//","//"]
[0,null,null,null,null,null,"","//","//"]
[0,null,null,null,null,null,"","//","//"]
[0,null,null,null,null,null,"","//","//"]
[0,null,null,null,null,null,"","//","//"]
[0,null,null,null,null,null,"","//","//"]
[0,null,null,null,null,null,"","//","//"]
[0,null,null,null,null,null,"","//","//"]
[0,null,null,null,null,null,"","//","//"]
[0,null,null,null,null,null,"","//","//"]
[0,null,null,null,null,null,"","//","//"]
[0,null,null,null,null,null,"","//","//"]
[0,null,null,null,null,null,"","//","//"]
[0,null,null,null,null,null,"","//","//"]
[0,null,null,null,null,null,"","//","//"]
[0,null,null,null,null,null,"","//","//"]
[0,null,null,null,null,null,"","//","//"]
[0,null,null,null,null,null,"","//","//"]
[0,null,null,null,null,null,"","//","//"]
[0,null,null,null,null,null,"","//","//"]
[0,null,null,null,null,null,"","//","//"]
[0,null,null,null,null,null,"","//","//"]
[0,null,null,null,null,null,"","//","//"]
[0,null,null,null,null,null,"","//","//"]
[0,null,null,null,null,null,"","//","//"]
[0,null,null,null,null,null,"","//","//"]
[0,null,null,null,null,null,"","//","//"]
[0,null,null,null,null,null,"","//","//"]
[0,null,null,null,null,null,"","//","//"]
[0,null,null,null,null,null,"","//","//"]
[0,null,null,null,null,null,"","//","//"]
[0,null,null,null,null,null,"","//","//"]
[0,null,null,null,null,null,"","//","//"]
[0,null,null,null,null,null,"","//","//"]
[0,null,null,null,null,null,"","//","//"]
[0,null,null,null,null,null,"","//","//"]
[0,null,null,null,null,null,"","//","//"]
[0,null,null,null,null,null,"","//","//"]
[0,null,null,null,null,null,"","//","//"]
[0,null,null,null,null,null,"",{"$f":"IF(OR($G5312=\"NTSI\",$G5312=\"TTSI\"),$E5312,LEFT($E5312,4)&\"/\"&MID($E5312,5,2)&\"/\"&RIGHT($E5312,2))","v":"//"},{"$f":"IF(OR($G5312=\"NTSI\",$G5312=\"TTSI\"),$F5312,LEFT($F5312,4)&\"/\"&MID($F5312,5,2)&\"/\"&RIGHT($F5312,2))","v":"//"}]
[0,null,null,null,null,null,"","//","//"]
[0,null,null,null,null,null,"","//","//"]
[0,null,null,null,null,null,"","//","//"]
[0,null,null,null,null,null,"","//","//"]
[{"$f":"IF(RIGHT(B5317,1)=\"H\",LEFT(B5317,11)&\"B\",B5317)","v":0},null,null,null,null,null,{"$f":"MID(C5317,4,4)","v":""},"//","//"]
[0,null,null,null,null,null,"","//","//"]
[0,null,null,null,null,null,"","//","//"]
[0,null,null,null,null,null,"","//","//"]
[0,null,null,null,null,null,"","//","//"]
[0,null,null,null,null,null,"","//","//"]
[0,null,null,null,null,null,"","//","//"]
[0,null,null,null,null,null,"","//","//"]
[0,null,null,null,null,null,"","//","//"]
[0,null,null,null,null,null,"","//","//"]
[0,null,null,null,null,null,"","//","//"]
[0,null,null,null,null,null,"","//","//"]
[0,null,null,null,null,null,"","//","//"]
[0,null,null,null,null,null,"","//","//"]
[0,null,null,null,null,null,"","//","//"]
[0,null,null,null,null,null,"","//","//"]
[0,null,null,null,null,null,"","//","//"]
[0,null,null,null,null,null,"","//","//"]
[0,null,null,null,null,null,"","//","//"]
[0,null,null,null,null,null,"","//","//"]
[0,null,null,null,null,null,"","//","//"]
[0,null,null,null,null,null,"","//","//"]
[0,null,null,null,null,null,"","//","//"]
[0,null,null,null,null,null,"","//","//"]
[0,null,null,null,null,null,"","//","//"]
[0,null,null,null,null,null,"","//","//"]
[0,null,null,null,null,null,"","//","//"]
[0,null,null,null,null,null,"","//","//"]
[0,null,null,null,null,null,"","//","//"]
[0,null,null,null,null,null,"","//","//"]
[0,null,null,null,null,null,"","//","//"]
[0,null,null,null,null,null,"","//","//"]
[0,null,null,null,null,null,"","//","//"]
[0,null,null,null,null,null,"","//","//"]
[0,null,null,null,null,null,"","//","//"]
[0,null,null,null,null,null,"","//","//"]
[0,null,null,null,null,null,"","//","//"]
[0,null,null,null,null,null,"","//","//"]
[0,null,null,null,null,null,"","//","//"]
[0,null,null,null,null,null,"","//","//"]
[0,null,null,null,null,null,"","//","//"]
[0,null,null,null,null,null,"","//","//"]
[0,null,null,null,null,null,"","//","//"]
[0,null,null,null,null,null,"","//","//"]
[0,null,null,null,null,null,"","//","//"]
[0,null,null,null,null,null,"","//","//"]
[0,null,null,null,null,null,"","//","//"]
[0,null,null,null,null,null,"","//","//"]
[0,null,null,null,null,null,"","//","//"]
[0,null,null,null,null,null,"","//","//"]
[0,null,null,null,null,null,"","//","//"]
[0,null,null,null,null,null,"","//","//"]
[0,null,null,null,null,null,"","//","//"]
[0,null,null,null,null,null,"","//","//"]
[0,null,null,null,null,null,"","//","//"]
[0,null,null,null,null,null,"","//","//"]
[0,null,null,null,null,null,"","//","//"]
[0,null,null,null,null,null,"","//","//"]
[0,null,null,null,null,null,"","//","//"]
[0,null,null,null,null,null,"",{"$f":"IF(OR($G5376=\"NTSI\",$G5376=\"TTSI\"),$E5376,LEFT($E5376,4)&\"/\"&MID($E5376,5,2)&\"/\"&RIGHT($E5376,2))","v":"//"},{"$f":"IF(OR($G5376=\"NTSI\",$G5376=\"TTSI\"),$F5376,LEFT($F5376,4)&\"/\"&MID($F5376,5,2)&\"/\"&RIGHT($F5376,2))","v":"//"}]
[0,null,null,null,null,null,"","//","//"]
[0,null,null,null,null,null,"","//","//"]
[0,null,null,null,null,null,"","//","//"]
[0,null,null,null,null,null,"","//","//"]
[{"$f":"IF(RIGHT(B5381,1)=\"H\",LEFT(B5381,11)&\"B\",B5381)","v":0},null,null,null,null,null,{"$f":"MID(C5381,4,4)","v":""},"//","//"]
[0,null,null,null,null,null,"","//","//"]
[0,null,null,null,null,null,"","//","//"]
[0,null,null,null,null,null,"","//","//"]
[0,null,null,null,null,null,"","//","//"]
[0,null,null,null,null,null,"","//","//"]
[0,null,null,null,null,null,"","//","//"]
[0,null,null,null,null,null,"","//","//"]
[0,null,null,null,null,null,"","//","//"]
[0,null,null,null,null,null,"","//","//"]
[0,null,null,null,null,null,"","//","//"]
[0,null,null,null,null,null,"","//","//"]
[0,null,null,null,null,null,"","//","//"]
[0,null,null,null,null,null,"","//","//"]
[0,null,null,null,null,null,"","//","//"]
[0,null,null,null,null,null,"","//","//"]
[0,null,null,null,null,null,"","//","//"]
[0,null,null,null,null,null,"","//","//"]
[0,null,null,null,null,null,"","//","//"]
[0,null,null,null,null,null,"","//","//"]
[0,null,null,null,null,null,"","//","//"]
[0,null,null,null,null,null,"","//","//"]
[0,null,null,null,null,null,"","//","//"]
[0,null,null,null,null,null,"","//","//"]
[0,null,null,null,null,null,"","//","//"]
[0,null,null,null,null,null,"","//","//"]
[0,null,null,null,null,null,"","//","//"]
[0,null,null,null,null,null,"","//","//"]
[0,null,null,null,null,null,"","//","//"]
[0,null,null,null,null,null,"","//","//"]
[0,null,null,null,null,null,"","//","//"]
[0,null,null,null,null,null,"","//","//"]
[0,null,null,null,null,null,"","//","//"]
[0,null,null,null,null,null,"","//","//"]
[0,null,null,null,null,null,"","//","//"]
[0,null,null,null,null,null,"","//","//"]
[0,null,null,null,null,null,"","//","//"]
[0,null,null,null,null,null,"","//","//"]
[0,null,null,null,null,null,"","//","//"]
[0,null,null,null,null,null,"","//","//"]
[0,null,null,null,null,null,"","//","//"]
[0,null,null,null,null,null,"","//","//"]
[0,null,null,null,null,null,"","//","//"]
[0,null,null,null,null,null,"","//","//"]
[0,null,null,null,null,null,"","//","//"]
[0,null,null,null,null,null,"","//","//"]
[0,null,null,null,null,null,"","//","//"]
[0,null,null,null,null,null,"","//","//"]
[0,null,null,null,null,null,"","//","//"]
[0,null,null,null,null,null,"","//","//"]
[0,null,null,null,null,null,"","//","//"]
[0,null,null,null,null,null,"","//","//"]
[0,null,null,null,null,null,"","//","//"]
[0,null,null,null,null,null,"","//","//"]
[0,null,null,null,null,null,"","//","//"]
[0,null,null,null,null,null,"","//","//"]
[0,null,null,null,null,null,"","//","//"]
[0,null,null,null,null,null,"","//","//"]
[0,null,null,null,null,null,"","//","//"]
[0,null,null,null,null,null,"",{"$f":"IF(OR($G5440=\"NTSI\",$G5440=\"TTSI\"),$E5440,LEFT($E5440,4)&\"/\"&MID($E5440,5,2)&\"/\"&RIGHT($E5440,2))","v":"//"},{"$f":"IF(OR($G5440=\"NTSI\",$G5440=\"TTSI\"),$F5440,LEFT($F5440,4)&\"/\"&MID($F5440,5,2)&\"/\"&RIGHT($F5440,2))","v":"//"}]
[0,null,null,null,null,null,"","//","//"]
[0,null,null,null,null,null,"","//","//"]
[0,null,null,null,null,null,"","//","//"]
[0,null,null,null,null,null,"","//","//"]
[{"$f":"IF(RIGHT(B5445,1)=\"H\",LEFT(B5445,11)&\"B\",B5445)","v":0},null,null,null,null,null,{"$f":"MID(C5445,4,4)","v":""},"//","//"]
[0,null,null,null,null,null,"","//","//"]
[0,null,null,null,null,null,"","//","//"]
[0,null,null,null,null,null,"","//","//"]
[0,null,null,null,null,null,"","//","//"]
[0,null,null,null,null,null,"","//","//"]
[0,null,null,null,null,null,"","//","//"]
[0,null,null,null,null,null,"","//","//"]
[0,null,null,null,null,null,"","//","//"]
[0,null,null,null,null,null,"","//","//"]
[0,null,null,null,null,null,"","//","//"]
[0,null,null,null,null,null,"","//","//"]
[0,null,null,null,null,null,"","//","//"]
[0,null,null,null,null,null,"","//","//"]
[0,null,null,null,null,null,"","//","//"]
[0,null,null,null,null,null,"","//","//"]
[0,null,null,null,null,null,"","//","//"]
[0,null,null,null,null,null,"","//","//"]
[0,null,null,null,null,null,"","//","//"]
[0,null,null,null,null,null,"","//","//"]
[0,null,null,null,null,null,"","//","//"]
[0,null,null,null,null,null,"","//","//"]
[0,null,null,null,null,null,"","//","//"]
[0,null,null,null,null,null,"","//","//"]
[0,null,null,null,null,null,"","//","//"]
[0,null,null,null,null,null,"","//","//"]
[0,null,null,null,null,null,"","//","//"]
[0,null,null,null,null,null,"","//","//"]
[0,null,null,null,null,null,"","//","//"]
[0,null,null,null,null,null,"","//","//"]
[0,null,null,null,null,null,"","//","//"]
[0,null,null,null,null,null,"","//","//"]
[0,null,null,null,null,null,"","//","//"]
[0,null,null,null,null,null,"","//","//"]
[0,null,null,null,null,null,"","//","//"]
[0,null,null,null,null,null,"","//","//"]
[0,null,null,null,null,null,"","//","//"]
[0,null,null,null,null,null,"","//","//"]
[0,null,null,null,null,null,"","//","//"]
[0,null,null,null,null,null,"","//","//"]
[0,null,null,null,null,null,"","//","//"]
[0,null,null,null,null,null,"","//","//"]
[0,null,null,null,null,null,"","//","//"]
[0,null,null,null,null,null,"","//","//"]
[0,null,null,null,null,null,"","//","//"]
[0,null,null,null,null,null,"","//","//"]
[0,null,null,null,null,null,"","//","//"]
[0,null,null,null,null,null,"","//","//"]
[0,null,null,null,null,null,"","//","//"]
[0,null,null,null,null,null,"","//","//"]
[0,null,null,null,null,null,"","//","//"]
[0,null,null,null,null,null,"","//","//"]
[0,null,null,null,null,null,"","//","//"]
[0,null,null,null,null,null,"","//","//"]
[0,null,null,null,null,null,"","//","//"]
[0,null,null,null,null,null,"","//","//"]
[0,null,null,null,null,null,"","//","//"]
[0,null,null,null,null,null,"","//","//"]
[0,null,null,null,null,null,"","//","//"]
[0,null,null,null,null,null,"",{"$f":"IF(OR($G5504=\"NTSI\",$G5504=\"TTSI\"),$E5504,LEFT($E5504,4)&\"/\"&MID($E5504,5,2)&\"/\"&RIGHT($E5504,2))","v":"//"},{"$f":"IF(OR($G5504=\"NTSI\",$G5504=\"TTSI\"),$F5504,LEFT($F5504,4)&\"/\"&MID($F5504,5,2)&\"/\"&RIGHT($F5504,2))","v":"//"}]
[0,null,null,null,null,null,"","//","//"]
[0,null,null,null,null,null,"","//","//"]
[0,null,null,null,null,null,"","//","//"]
[0,null,null,null,null,null,"","//","//"]
[{"$f":"IF(RIGHT(B5509,1)=\"H\",LEFT(B5509,11)&\"B\",B5509)","v":0},null,null,null,null,null,{"$f":"MID(C5509,4,4)","v":""},"//","//"]
[0,null,null,null,null,null,"","//","//"]
[0,null,null,null,null,null,"","//","//"]
[0,null,null,null,null,null,"","//","//"]
[0,null,null,null,null,null,"","//","//"]
[0,null,null,null,null,null,"","//","//"]
[0,null,null,null,null,null,"","//","//"]
[0,null,null,null,null,null,"","//","//"]
[0,null,null,null,null,null,"","//","//"]
[0,null,null,null,null,null,"","//","//"]
[0,null,null,null,null,null,"","//","//"]
[0,null,null,null,null,null,"","//","//"]
[0,null,null,null,null,null,"","//","//"]
[0,null,null,null,null,null,"","//","//"]
[0,null,null,null,null,null,"","//","//"]
[0,null,null,null,null,null,"","//","//"]
[0,null,null,null,null,null,"","//","//"]
[0,null,null,null,null,null,"","//","//"]
[0,null,null,null,null,null,"","//","//"]
[0,null,null,null,null,null,"","//","//"]
[0,null,null,null,null,null,"","//","//"]
[0,null,null,null,null,null,"","//","//"]
[0,null,null,null,null,null,"","//","//"]
[0,null,null,null,null,null,"","//","//"]
[0,null,null,null,null,null,"","//","//"]
[0,null,null,null,null,null,"","//","//"]
[0,null,null,null,null,null,"","//","//"]
[0,null,null,null,null,null,"","//","//"]
[0,null,null,null,null,null,"","//","//"]
[0,null,null,null,null,null,"","//","//"]
[0,null,null,null,null,null,"","//","//"]
[0,null,null,null,null,null,"","//","//"]
[0,null,null,null,null,null,"","//","//"]
[0,null,null,null,null,null,"","//","//"]
[0,null,null,null,null,null,"","//","//"]
[0,null,null,null,null,null,"","//","//"]
[0,null,null,null,null,null,"","//","//"]
[0,null,null,null,null,null,"","//","//"]
[0,null,null,null,null,null,"","//","//"]
[0,null,null,null,null,null,"","//","//"]
[0,null,null,null,null,null,"","//","//"]
[0,null,null,null,null,null,"","//","//"]
[0,null,null,null,null,null,"","//","//"]
[0,null,null,null,null,null,"","//","//"]
[0,null,null,null,null,null,"","//","//"]
[0,null,null,null,null,null,"","//","//"]
[0,null,null,null,null,null,"","//","//"]
[0,null,null,null,null,null,"","//","//"]
[0,null,null,null,null,null,"","//","//"]
[0,null,null,null,null,null,"","//","//"]
[0,null,null,null,null,null,"","//","//"]
[0,null,null,null,null,null,"","//","//"]
[0,null,null,null,null,null,"","//","//"]
[0,null,null,null,null,null,"","//","//"]
[0,null,null,null,null,null,"","//","//"]
[0,null,null,null,null,null,"","//","//"]
[0,null,null,null,null,null,"","//","//"]
[0,null,null,null,null,null,"","//","//"]
[0,null,null,null,null,null,"","//","//"]
[0,null,null,null,null,null,"",{"$f":"IF(OR($G5568=\"NTSI\",$G5568=\"TTSI\"),$E5568,LEFT($E5568,4)&\"/\"&MID($E5568,5,2)&\"/\"&RIGHT($E5568,2))","v":"//"},{"$f":"IF(OR($G5568=\"NTSI\",$G5568=\"TTSI\"),$F5568,LEFT($F5568,4)&\"/\"&MID($F5568,5,2)&\"/\"&RIGHT($F5568,2))","v":"//"}]
[0,null,null,null,null,null,"","//","//"]
[0,null,null,null,null,null,"","//","//"]
[0,null,null,null,null,null,"","//","//"]
[0,null,null,null,null,null,"","//","//"]
[{"$f":"IF(RIGHT(B5573,1)=\"H\",LEFT(B5573,11)&\"B\",B5573)","v":0},null,null,null,null,null,{"$f":"MID(C5573,4,4)","v":""},"//","//"]
[0,null,null,null,null,null,"","//","//"]
[0,null,null,null,null,null,"","//","//"]
[0,null,null,null,null,null,"","//","//"]
[0,null,null,null,null,null,"","//","//"]
[0,null,null,null,null,null,"","//","//"]
[0,null,null,null,null,null,"","//","//"]
[0,null,null,null,null,null,"","//","//"]
[0,null,null,null,null,null,"","//","//"]
[0,null,null,null,null,null,"","//","//"]
[0,null,null,null,null,null,"","//","//"]
[0,null,null,null,null,null,"","//","//"]
[0,null,null,null,null,null,"","//","//"]
[0,null,null,null,null,null,"","//","//"]
[0,null,null,null,null,null,"","//","//"]
[0,null,null,null,null,null,"","//","//"]
[0,null,null,null,null,null,"","//","//"]
[0,null,null,null,null,null,"","//","//"]
[0,null,null,null,null,null,"","//","//"]
[0,null,null,null,null,null,"","//","//"]
[0,null,null,null,null,null,"","//","//"]
[0,null,null,null,null,null,"","//","//"]
[0,null,null,null,null,null,"","//","//"]
[0,null,null,null,null,null,"","//","//"]
[0,null,null,null,null,null,"","//","//"]
[0,null,null,null,null,null,"","//","//"]
[0,null,null,null,null,null,"","//","//"]
[0,null,null,null,null,null,"","//","//"]
[0,null,null,null,null,null,"","//","//"]
[0,null,null,null,null,null,"","//","//"]
[0,null,null,null,null,null,"","//","//"]
[0,null,null,null,null,null,"","//","//"]
[0,null,null,null,null,null,"","//","//"]
[0,null,null,null,null,null,"","//","//"]
[0,null,null,null,null,null,"","//","//"]
[0,null,null,null,null,null,"","//","//"]
[0,null,null,null,null,null,"","//","//"]
[0,null,null,null,null,null,"","//","//"]
[0,null,null,null,null,null,"","//","//"]
[0,null,null,null,null,null,"","//","//"]
[0,null,null,null,null,null,"","//","//"]
[0,null,null,null,null,null,"","//","//"]
[0,null,null,null,null,null,"","//","//"]
[0,null,null,null,null,null,"","//","//"]
[0,null,null,null,null,null,"","//","//"]
[0,null,null,null,null,null,"","//","//"]
[0,null,null,null,null,null,"","//","//"]
[0,null,null,null,null,null,"","//","//"]
[0,null,null,null,null,null,"","//","//"]
[0,null,null,null,null,null,"","//","//"]
[0,null,null,null,null,null,"","//","//"]
[0,null,null,null,null,null,"","//","//"]
[0,null,null,null,null,null,"","//","//"]
[0,null,null,null,null,null,"","//","//"]
[0,null,null,null,null,null,"","//","//"]
[0,null,null,null,null,null,"","//","//"]
[0,null,null,null,null,null,"","//","//"]
[0,null,null,null,null,null,"","//","//"]
[0,null,null,null,null,null,"","//","//"]
[0,null,null,null,null,null,"",{"$f":"IF(OR($G5632=\"NTSI\",$G5632=\"TTSI\"),$E5632,LEFT($E5632,4)&\"/\"&MID($E5632,5,2)&\"/\"&RIGHT($E5632,2))","v":"//"},{"$f":"IF(OR($G5632=\"NTSI\",$G5632=\"TTSI\"),$F5632,LEFT($F5632,4)&\"/\"&MID($F5632,5,2)&\"/\"&RIGHT($F5632,2))","v":"//"}]
[0,null,null,null,null,null,"","//","//"]
[0,null,null,null,null,null,"","//","//"]
[0,null,null,null,null,null,"","//","//"]
[0,null,null,null,null,null,"","//","//"]
[{"$f":"IF(RIGHT(B5637,1)=\"H\",LEFT(B5637,11)&\"B\",B5637)","v":0},null,null,null,null,null,{"$f":"MID(C5637,4,4)","v":""},"//","//"]
[0,null,null,null,null,null,"","//","//"]
[0,null,null,null,null,null,"","//","//"]
[0,null,null,null,null,null,"","//","//"]
[0,null,null,null,null,null,"","//","//"]
[0,null,null,null,null,null,"","//","//"]
[0,null,null,null,null,null,"","//","//"]
[0,null,null,null,null,null,"","//","//"]
[0,null,null,null,null,null,"","//","//"]
[0,null,null,null,null,null,"","//","//"]
[0,null,null,null,null,null,"","//","//"]
[0,null,null,null,null,null,"","//","//"]
[0,null,null,null,null,null,"","//","//"]
[0,null,null,null,null,null,"","//","//"]
[0,null,null,null,null,null,"","//","//"]
[0,null,null,null,null,null,"","//","//"]
[0,null,null,null,null,null,"","//","//"]
[0,null,null,null,null,null,"","//","//"]
[0,null,null,null,null,null,"","//","//"]
[0,null,null,null,null,null,"","//","//"]
[0,null,null,null,null,null,"","//","//"]
[0,null,null,null,null,null,"","//","//"]
[0,null,null,null,null,null,"","//","//"]
[0,null,null,null,null,null,"","//","//"]
[0,null,null,null,null,null,"","//","//"]
[0,null,null,null,null,null,"","//","//"]
[0,null,null,null,null,null,"","//","//"]
[0,null,null,null,null,null,"","//","//"]
[0,null,null,null,null,null,"","//","//"]
[0,null,null,null,null,null,"","//","//"]
[0,null,null,null,null,null,"","//","//"]
[0,null,null,null,null,null,"","//","//"]
[0,null,null,null,null,null,"","//","//"]
[0,null,null,null,null,null,"","//","//"]
[0,null,null,null,null,null,"","//","//"]
[0,null,null,null,null,null,"","//","//"]
[0,null,null,null,null,null,"","//","//"]
[0,null,null,null,null,null,"","//","//"]
[0,null,null,null,null,null,"","//","//"]
[0,null,null,null,null,null,"","//","//"]
[0,null,null,null,null,null,"","//","//"]
[0,null,null,null,null,null,"","//","//"]
[0,null,null,null,null,null,"","//","//"]
[0,null,null,null,null,null,"","//","//"]
[0,null,null,null,null,null,"","//","//"]
[0,null,null,null,null,null,"","//","//"]
[0,null,null,null,null,null,"","//","//"]
[0,null,null,null,null,null,"","//","//"]
[0,null,null,null,null,null,"","//","//"]
[0,null,null,null,null,null,"","//","//"]
[0,null,null,null,null,null,"","//","//"]
[0,null,null,null,null,null,"","//","//"]
[0,null,null,null,null,null,"","//","//"]
[0,null,null,null,null,null,"","//","//"]
[0,null,null,null,null,null,"","//","//"]
[0,null,null,null,null,null,"","//","//"]
[0,null,null,null,null,null,"","//","//"]
[0,null,null,null,null,null,"","//","//"]
[0,null,null,null,null,null,"","//","//"]
[0,null,null,null,null,null,"",{"$f":"IF(OR($G5696=\"NTSI\",$G5696=\"TTSI\"),$E5696,LEFT($E5696,4)&\"/\"&MID($E5696,5,2)&\"/\"&RIGHT($E5696,2))","v":"//"},{"$f":"IF(OR($G5696=\"NTSI\",$G5696=\"TTSI\"),$F5696,LEFT($F5696,4)&\"/\"&MID($F5696,5,2)&\"/\"&RIGHT($F5696,2))","v":"//"}]
[0,null,null,null,null,null,"","//","//"]
[0,null,null,null,null,null,"","//","//"]
[0,null,null,null,null,null,"","//","//"]
[0,null,null,null,null,null,"","//","//"]
[{"$f":"IF(RIGHT(B5701,1)=\"H\",LEFT(B5701,11)&\"B\",B5701)","v":0},null,null,null,null,null,{"$f":"MID(C5701,4,4)","v":""},"//","//"]
[0,null,null,null,null,null,"","//","//"]
[0,null,null,null,null,null,"","//","//"]
[0,null,null,null,null,null,"","//","//"]
[0,null,null,null,null,null,"","//","//"]
[0,null,null,null,null,null,"","//","//"]
[0,null,null,null,null,null,"","//","//"]
[0,null,null,null,null,null,"","//","//"]
[0,null,null,null,null,null,"","//","//"]
[0,null,null,null,null,null,"","//","//"]
[0,null,null,null,null,null,"","//","//"]
[0,null,null,null,null,null,"","//","//"]
[0,null,null,null,null,null,"","//","//"]
[0,null,null,null,null,null,"","//","//"]
[0,null,null,null,null,null,"","//","//"]
[0,null,null,null,null,null,"","//","//"]
[0,null,null,null,null,null,"","//","//"]
[0,null,null,null,null,null,"","//","//"]
[0,null,null,null,null,null,"","//","//"]
[0,null,null,null,null,null,"","//","//"]
[0,null,null,null,null,null,"","//","//"]
[0,null,null,null,null,null,"","//","//"]
[0,null,null,null,null,null,"","//","//"]
[0,null,null,null,null,null,"","//","//"]
[0,null,null,null,null,null,"","//","//"]
[0,null,null,null,null,null,"","//","//"]
[0,null,null,null,null,null,"","//","//"]
[0,null,null,null,null,null,"","//","//"]
[0,null,null,null,null,null,"","//","//"]
[0,null,null,null,null,null,"","//","//"]
[0,null,null,null,null,null,"","//","//"]
[0,null,null,null,null,null,"","//","//"]
[0,null,null,null,null,null,"","//","//"]
[0,null,null,null,null,null,"","//","//"]
[0,null,null,null,null,null,"","//","//"]
[0,null,null,null,null,null,"","//","//"]
[0,null,null,null,null,null,"","//","//"]
[0,null,null,null,null,null,"","//","//"]
[0,null,null,null,null,null,"","//","//"]
[0,null,null,null,null,null,"","//","//"]
[0,null,null,null,null,null,"","//","//"]
[0,null,null,null,null,null,"","//","//"]
[0,null,null,null,null,null,"","//","//"]
[0,null,null,null,null,null,"","//","//"]
[0,null,null,null,null,null,"","//","//"]
[0,null,null,null,null,null,"","//","//"]
[0,null,null,null,null,null,"","//","//"]
[0,null,null,null,null,null,"","//","//"]
[0,null,null,null,null,null,"","//","//"]
[0,null,null,null,null,null,"","//","//"]
[0,null,null,null,null,null,"","//","//"]
[0,null,null,null,null,null,"","//","//"]
[0,null,null,null,null,null,"","//","//"]
[0,null,null,null,null,null,"","//","//"]
[0,null,null,null,null,null,"","//","//"]
[0,null,null,null,null,null,"","//","//"]
[0,null,null,null,null,null,"","//","//"]
[0,null,null,null,null,null,"","//","//"]
[0,null,null,null,null,null,"","//","//"]
[0,null,null,null,null,null,"",{"$f":"IF(OR($G5760=\"NTSI\",$G5760=\"TTSI\"),$E5760,LEFT($E5760,4)&\"/\"&MID($E5760,5,2)&\"/\"&RIGHT($E5760,2))","v":"//"},{"$f":"IF(OR($G5760=\"NTSI\",$G5760=\"TTSI\"),$F5760,LEFT($F5760,4)&\"/\"&MID($F5760,5,2)&\"/\"&RIGHT($F5760,2))","v":"//"}]
[0,null,null,null,null,null,"","//","//"]
[0,null,null,null,null,null,"","//","//"]
[0,null,null,null,null,null,"","//","//"]
[0,null,null,null,null,null,"","//","//"]
[{"$f":"IF(RIGHT(B5765,1)=\"H\",LEFT(B5765,11)&\"B\",B5765)","v":0},null,null,null,null,null,{"$f":"MID(C5765,4,4)","v":""},"//","//"]
[0,null,null,null,null,null,"","//","//"]
[0,null,null,null,null,null,"","//","//"]
[0,null,null,null,null,null,"","//","//"]
[0,null,null,null,null,null,"","//","//"]
[0,null,null,null,null,null,"","//","//"]
[0,null,null,null,null,null,"","//","//"]
[0,null,null,null,null,null,"","//","//"]
[0,null,null,null,null,null,"","//","//"]
[0,null,null,null,null,null,"","//","//"]
[0,null,null,null,null,null,"","//","//"]
[0,null,null,null,null,null,"","//","//"]
[0,null,null,null,null,null,"","//","//"]
[0,null,null,null,null,null,"","//","//"]
[0,null,null,null,null,null,"","//","//"]
[0,null,null,null,null,null,"","//","//"]
[0,null,null,null,null,null,"","//","//"]
[0,null,null,null,null,null,"","//","//"]
[0,null,null,null,null,null,"","//","//"]
[0,null,null,null,null,null,"","//","//"]
[0,null,null,null,null,null,"","//","//"]
[0,null,null,null,null,null,"","//","//"]
[0,null,null,null,null,null,"","//","//"]
[0,null,null,null,null,null,"","//","//"]
[0,null,null,null,null,null,"","//","//"]
[0,null,null,null,null,null,"","//","//"]
[0,null,null,null,null,null,"","//","//"]
[0,null,null,null,null,null,"","//","//"]
[0,null,null,null,null,null,"","//","//"]
[0,null,null,null,null,null,"","//","//"]
[0,null,null,null,null,null,"","//","//"]
[0,null,null,null,null,null,"","//","//"]
[0,null,null,null,null,null,"","//","//"]
[0,null,null,null,null,null,"","//","//"]
[0,null,null,null,null,null,"","//","//"]
[0,null,null,null,null,null,"","//","//"]
[0,null,null,null,null,null,"","//","//"]
[0,null,null,null,null,null,"","//","//"]
[0,null,null,null,null,null,"","//","//"]
[0,null,null,null,null,null,"","//","//"]
[0,null,null,null,null,null,"","//","//"]
[0,null,null,null,null,null,"","//","//"]
[0,null,null,null,null,null,"","//","//"]
[0,null,null,null,null,null,"","//","//"]
[0,null,null,null,null,null,"","//","//"]
[0,null,null,null,null,null,"","//","//"]
[0,null,null,null,null,null,"","//","//"]
[0,null,null,null,null,null,"","//","//"]
[0,null,null,null,null,null,"","//","//"]
[0,null,null,null,null,null,"","//","//"]
[0,null,null,null,null,null,"","//","//"]
[0,null,null,null,null,null,"","//","//"]
[0,null,null,null,null,null,"","//","//"]
[0,null,null,null,null,null,"","//","//"]
[0,null,null,null,null,null,"","//","//"]
[0,null,null,null,null,null,"","//","//"]
[0,null,null,null,null,null,"","//","//"]
[0,null,null,null,null,null,"","//","//"]
[0,null,null,null,null,null,"","//","//"]
[0,null,null,null,null,null,"",{"$f":"IF(OR($G5824=\"NTSI\",$G5824=\"TTSI\"),$E5824,LEFT($E5824,4)&\"/\"&MID($E5824,5,2)&\"/\"&RIGHT($E5824,2))","v":"//"},{"$f":"IF(OR($G5824=\"NTSI\",$G5824=\"TTSI\"),$F5824,LEFT($F5824,4)&\"/\"&MID($F5824,5,2)&\"/\"&RIGHT($F5824,2))","v":"//"}]
[0,null,null,null,null,null,"","//","//"]
[0,null,null,null,null,null,"","//","//"]
[0,null,null,null,null,null,"","//","//"]
[0,null,null,null,null,null,"","//","//"]
[{"$f":"IF(RIGHT(B5829,1)=\"H\",LEFT(B5829,11)&\"B\",B5829)","v":0},null,null,null,null,null,{"$f":"MID(C5829,4,4)","v":""},"//","//"]
[0,null,null,null,null,null,"","//","//"]
[0,null,null,null,null,null,"","//","//"]
[0,null,null,null,null,null,"","//","//"]
[0,null,null,null,null,null,"","//","//"]
[0,null,null,null,null,null,"","//","//"]
[0,null,null,null,null,null,"","//","//"]
[0,null,null,null,null,null,"","//","//"]
[0,null,null,null,null,null,"","//","//"]
[0,null,null,null,null,null,"","//","//"]
[0,null,null,null,null,null,"","//","//"]
[0,null,null,null,null,null,"","//","//"]
[0,null,null,null,null,null,"","//","//"]
[0,null,null,null,null,null,"","//","//"]
[0,null,null,null,null,null,"","//","//"]
[0,null,null,null,null,null,"","//","//"]
[0,null,null,null,null,null,"","//","//"]
[0,null,null,null,null,null,"","//","//"]
[0,null,null,null,null,null,"","//","//"]
[0,null,null,null,null,null,"","//","//"]
[0,null,null,null,null,null,"","//","//"]
[0,null,null,null,null,null,"","//","//"]
[0,null,null,null,null,null,"","//","//"]
[0,null,null,null,null,null,"","//","//"]
[0,null,null,null,null,null,"","//","//"]
[0,null,null,null,null,null,"","//","//"]
[0,null,null,null,null,null,"","//","//"]
[0,null,null,null,null,null,"","//","//"]
[0,null,null,null,null,null,"","//","//"]
[0,null,null,null,null,null,"","//","//"]
[0,null,null,null,null,null,"","//","//"]
[0,null,null,null,null,null,"","//","//"]
[0,null,null,null,null,null,"","//","//"]
[0,null,null,null,null,null,"","//","//"]
[0,null,null,null,null,null,"","//","//"]
[0,null,null,null,null,null,"","//","//"]
[0,null,null,null,null,null,"","//","//"]
[0,null,null,null,null,null,"","//","//"]
[0,null,null,null,null,null,"","//","//"]
[0,null,null,null,null,null,"","//","//"]
[0,null,null,null,null,null,"","//","//"]
[0,null,null,null,null,null,"","//","//"]
[0,null,null,null,null,null,"","//","//"]
[0,null,null,null,null,null,"","//","//"]
[0,null,null,null,null,null,"","//","//"]
[0,null,null,null,null,null,"","//","//"]
[0,null,null,null,null,null,"","//","//"]
[0,null,null,null,null,null,"","//","//"]
[0,null,null,null,null,null,"","//","//"]
[0,null,null,null,null,null,"","//","//"]
[0,null,null,null,null,null,"","//","//"]
[0,null,null,null,null,null,"","//","//"]
[0,null,null,null,null,null,"","//","//"]
[0,null,null,null,null,null,"","//","//"]
[0,null,null,null,null,null,"","//","//"]
[0,null,null,null,null,null,"","//","//"]
[0,null,null,null,null,null,"","//","//"]
[0,null,null,null,null,null,"","//","//"]
[0,null,null,null,null,null,"","//","//"]
[0,null,null,null,null,null,"",{"$f":"IF(OR($G5888=\"NTSI\",$G5888=\"TTSI\"),$E5888,LEFT($E5888,4)&\"/\"&MID($E5888,5,2)&\"/\"&RIGHT($E5888,2))","v":"//"},{"$f":"IF(OR($G5888=\"NTSI\",$G5888=\"TTSI\"),$F5888,LEFT($F5888,4)&\"/\"&MID($F5888,5,2)&\"/\"&RIGHT($F5888,2))","v":"//"}]
[0,null,null,null,null,null,"","//","//"]
[0,null,null,null,null,null,"","//","//"]
[0,null,null,null,null,null,"","//","//"]
[0,null,null,null,null,null,"","//","//"]
[{"$f":"IF(RIGHT(B5893,1)=\"H\",LEFT(B5893,11)&\"B\",B5893)","v":0},null,null,null,null,null,{"$f":"MID(C5893,4,4)","v":""},"//","//"]
[0,null,null,null,null,null,"","//","//"]
[0,null,null,null,null,null,"","//","//"]
[0,null,null,null,null,null,"","//","//"]
[0,null,null,null,null,null,"","//","//"]
[0,null,null,null,null,null,"","//","//"]
[0,null,null,null,null,null,"","//","//"]
[0,null,null,null,null,null,"","//","//"]
[0,null,null,null,null,null,"","//","//"]
[0,null,null,null,null,null,"","//","//"]
[0,null,null,null,null,null,"","//","//"]
[0,null,null,null,null,null,"","//","//"]
[0,null,null,null,null,null,"","//","//"]
[0,null,null,null,null,null,"","//","//"]
[0,null,null,null,null,null,"","//","//"]
[0,null,null,null,null,null,"","//","//"]
[0,null,null,null,null,null,"","//","//"]
[0,null,null,null,null,null,"","//","//"]
[0,null,null,null,null,null,"","//","//"]
[0,null,null,null,null,null,"","//","//"]
[0,null,null,null,null,null,"","//","//"]
[0,null,null,null,null,null,"","//","//"]
[0,null,null,null,null,null,"","//","//"]
[0,null,null,null,null,null,"","//","//"]
[0,null,null,null,null,null,"","//","//"]
[0,null,null,null,null,null,"","//","//"]
[0,null,null,null,null,null,"","//","//"]
[0,null,null,null,null,null,"","//","//"]
[0,null,null,null,null,null,"","//","//"]
[0,null,null,null,null,null,"","//","//"]
[0,null,null,null,null,null,"","//","//"]
[0,null,null,null,null,null,"","//","//"]
[0,null,null,null,null,null,"","//","//"]
[0,null,null,null,null,null,"","//","//"]
[0,null,null,null,null,null,"","//","//"]
[0,null,null,null,null,null,"","//","//"]
[0,null,null,null,null,null,"","//","//"]
[0,null,null,null,null,null,"","//","//"]
[0,null,null,null,null,null,"","//","//"]
[0,null,null,null,null,null,"","//","//"]
[0,null,null,null,null,null,"","//","//"]
[0,null,null,null,null,null,"","//","//"]
[0,null,null,null,null,null,"","//","//"]
[0,null,null,null,null,null,"","//","//"]
[0,null,null,null,null,null,"","//","//"]
[0,null,null,null,null,null,"","//","//"]
[0,null,null,null,null,null,"","//","//"]
[0,null,null,null,null,null,"","//","//"]
[0,null,null,null,null,null,"","//","//"]
[0,null,null,null,null,null,"","//","//"]
[0,null,null,null,null,null,"","//","//"]
[0,null,null,null,null,null,"","//","//"]
[0,null,null,null,null,null,"","//","//"]
[0,null,null,null,null,null,"","//","//"]
[0,null,null,null,null,null,"","//","//"]
[0,null,null,null,null,null,"","//","//"]
[0,null,null,null,null,null,"","//","//"]
[0,null,null,null,null,null,"","//","//"]
[0,null,null,null,null,null,"","//","//"]
[0,null,null,null,null,null,"",{"$f":"IF(OR($G5952=\"NTSI\",$G5952=\"TTSI\"),$E5952,LEFT($E5952,4)&\"/\"&MID($E5952,5,2)&\"/\"&RIGHT($E5952,2))","v":"//"},{"$f":"IF(OR($G5952=\"NTSI\",$G5952=\"TTSI\"),$F5952,LEFT($F5952,4)&\"/\"&MID($F5952,5,2)&\"/\"&RIGHT($F5952,2))","v":"//"}]
[0,null,null,null,null,null,"","//","//"]
[0,null,null,null,null,null,"","//","//"]
[0,null,null,null,null,null,"","//","//"]
[0,null,null,null,null,null,"","//","//"]
[{"$f":"IF(RIGHT(B5957,1)=\"H\",LEFT(B5957,11)&\"B\",B5957)","v":0},null,null,null,null,null,{"$f":"MID(C5957,4,4)","v":""},"//","//"]
[0,null,null,null,null,null,"","//","//"]
[0,null,null,null,null,null,"","//","//"]
[0,null,null,null,null,null,"","//","//"]
[0,null,null,null,null,null,"","//","//"]
[0,null,null,null,null,null,"","//","//"]
[0,null,null,null,null,null,"","//","//"]
[0,null,null,null,null,null,"","//","//"]
[0,null,null,null,null,null,"","//","//"]
[0,null,null,null,null,null,"","//","//"]
[0,null,null,null,null,null,"","//","//"]
[0,null,null,null,null,null,"","//","//"]
[0,null,null,null,null,null,"","//","//"]
[0,null,null,null,null,null,"","//","//"]
[0,null,null,null,null,null,"","//","//"]
[0,null,null,null,null,null,"","//","//"]
[0,null,null,null,null,null,"","//","//"]
[0,null,null,null,null,null,"","//","//"]
[0,null,null,null,null,null,"","//","//"]
[0,null,null,null,null,null,"","//","//"]
[0,null,null,null,null,null,"","//","//"]
[0,null,null,null,null,null,"","//","//"]
[0,null,null,null,null,null,"","//","//"]
[0,null,null,null,null,null,"","//","//"]
[0,null,null,null,null,null,"","//","//"]
[0,null,null,null,null,null,"","//","//"]
[0,null,null,null,null,null,"","//","//"]
[0,null,null,null,null,null,"","//","//"]
[0,null,null,null,null,null,"","//","//"]
[0,null,null,null,null,null,"","//","//"]
[0,null,null,null,null,null,"","//","//"]
[0,null,null,null,null,null,"","//","//"]
[0,null,null,null,null,null,"","//","//"]
[0,null,null,null,null,null,"","//","//"]
[0,null,null,null,null,null,"","//","//"]
[0,null,null,null,null,null,"","//","//"]
[0,null,null,null,null,null,"","//","//"]
[0,null,null,null,null,null,"","//","//"]
[0,null,null,null,null,null,"","//","//"]
[0,null,null,null,null,null,"","//","//"]
[0,null,null,null,null,null,"","//","//"]
[0,null,null,null,null,null,"","//","//"]
[0,null,null,null,null,null,"","//","//"]
[0,null,null,null,null,null,"","//","//"]
[0,null,null,null,null,null,"","//","//"]
[0,null,null,null,null,null,"","//","//"]
[0,null,null,null,null,null,"","//","//"]
[0,null,null,null,null,null,"","//","//"]
[0,null,null,null,null,null,"","//","//"]
[0,null,null,null,null,null,"","//","//"]
[0,null,null,null,null,null,"","//","//"]
[0,null,null,null,null,null,"","//","//"]
[0,null,null,null,null,null,"","//","//"]
[0,null,null,null,null,null,"","//","//"]
[0,null,null,null,null,null,"","//","//"]
[0,null,null,null,null,null,"","//","//"]
[0,null,null,null,null,null,"","//","//"]
[0,null,null,null,null,null,"","//","//"]
[0,null,null,null,null,null,"","//","//"]
[0,null,null,null,null,null,"",{"$f":"IF(OR($G6016=\"NTSI\",$G6016=\"TTSI\"),$E6016,LEFT($E6016,4)&\"/\"&MID($E6016,5,2)&\"/\"&RIGHT($E6016,2))","v":"//"},{"$f":"IF(OR($G6016=\"NTSI\",$G6016=\"TTSI\"),$F6016,LEFT($F6016,4)&\"/\"&MID($F6016,5,2)&\"/\"&RIGHT($F6016,2))","v":"//"}]
[0,null,null,null,null,null,"","//","//"]
[0,null,null,null,null,null,"","//","//"]
[0,null,null,null,null,null,"","//","//"]
[0,null,null,null,null,null,"","//","//"]
[{"$f":"IF(RIGHT(B6021,1)=\"H\",LEFT(B6021,11)&\"B\",B6021)","v":0},null,null,null,null,null,{"$f":"MID(C6021,4,4)","v":""},"//","//"]
[0,null,null,null,null,null,"","//","//"]
[0,null,null,null,null,null,"","//","//"]
[0,null,null,null,null,null,"","//","//"]
[0,null,null,null,null,null,"","//","//"]
[0,null,null,null,null,null,"","//","//"]
[0,null,null,null,null,null,"","//","//"]
[0,null,null,null,null,null,"","//","//"]
[0,null,null,null,null,null,"","//","//"]
[0,null,null,null,null,null,"","//","//"]
[0,null,null,null,null,null,"","//","//"]
[0,null,null,null,null,null,"","//","//"]
[0,null,null,null,null,null,"","//","//"]
[0,null,null,null,null,null,"","//","//"]
[0,null,null,null,null,null,"","//","//"]
[0,null,null,null,null,null,"","//","//"]
[0,null,null,null,null,null,"","//","//"]
[0,null,null,null,null,null,"","//","//"]
[0,null,null,null,null,null,"","//","//"]
[0,null,null,null,null,null,"","//","//"]
[0,null,null,null,null,null,"","//","//"]
[0,null,null,null,null,null,"","//","//"]
[0,null,null,null,null,null,"","//","//"]
[0,null,null,null,null,null,"","//","//"]
[0,null,null,null,null,null,"","//","//"]
[0,null,null,null,null,null,"","//","//"]
[0,null,null,null,null,null,"","//","//"]
[0,null,null,null,null,null,"","//","//"]
[0,null,null,null,null,null,"","//","//"]
[0,null,null,null,null,null,"","//","//"]
[0,null,null,null,null,null,"","//","//"]
[0,null,null,null,null,null,"","//","//"]
[0,null,null,null,null,null,"","//","//"]
[0,null,null,null,null,null,"","//","//"]
[0,null,null,null,null,null,"","//","//"]
[0,null,null,null,null,null,"","//","//"]
[0,null,null,null,null,null,"","//","//"]
[0,null,null,null,null,null,"","//","//"]
[0,null,null,null,null,null,"","//","//"]
[0,null,null,null,null,null,"","//","//"]
[0,null,null,null,null,null,"","//","//"]
[0,null,null,null,null,null,"","//","//"]
[0,null,null,null,null,null,"","//","//"]
[0,null,null,null,null,null,"","//","//"]
[0,null,null,null,null,null,"","//","//"]
[0,null,null,null,null,null,"","//","//"]
[0,null,null,null,null,null,"","//","//"]
[0,null,null,null,null,null,"","//","//"]
[0,null,null,null,null,null,"","//","//"]
[0,null,null,null,null,null,"","//","//"]
[0,null,null,null,null,null,"","//","//"]
[0,null,null,null,null,null,"","//","//"]
[0,null,null,null,null,null,"","//","//"]
[0,null,null,null,null,null,"","//","//"]
[0,null,null,null,null,null,"","//","//"]
[0,null,null,null,null,null,"","//","//"]
[0,null,null,null,null,null,"","//","//"]
[0,null,null,null,null,null,"","//","//"]
[0,null,null,null,null,null,"","//","//"]
[0,null,null,null,null,null,"",{"$f":"IF(OR($G6080=\"NTSI\",$G6080=\"TTSI\"),$E6080,LEFT($E6080,4)&\"/\"&MID($E6080,5,2)&\"/\"&RIGHT($E6080,2))","v":"//"},{"$f":"IF(OR($G6080=\"NTSI\",$G6080=\"TTSI\"),$F6080,LEFT($F6080,4)&\"/\"&MID($F6080,5,2)&\"/\"&RIGHT($F6080,2))","v":"//"}]
[0,null,null,null,null,null,"","//","//"]
[0,null,null,null,null,null,"","//","//"]
[0,null,null,null,null,null,"","//","//"]
[0,null,null,null,null,null,"","//","//"]
[{"$f":"IF(RIGHT(B6085,1)=\"H\",LEFT(B6085,11)&\"B\",B6085)","v":0},null,null,null,null,null,{"$f":"MID(C6085,4,4)","v":""},"//","//"]
[0,null,null,null,null,null,"","//","//"]
[0,null,null,null,null,null,"","//","//"]
[0,null,null,null,null,null,"","//","//"]
[0,null,null,null,null,null,"","//","//"]
[0,null,null,null,null,null,"","//","//"]
[0,null,null,null,null,null,"","//","//"]
[0,null,null,null,null,null,"","//","//"]
[0,null,null,null,null,null,"","//","//"]
[0,null,null,null,null,null,"","//","//"]
[0,null,null,null,null,null,"","//","//"]
[0,null,null,null,null,null,"","//","//"]
[0,null,null,null,null,null,"","//","//"]
[0,null,null,null,null,null,"","//","//"]
[0,null,null,null,null,null,"","//","//"]
[0,null,null,null,null,null,"","//","//"]
[0,null,null,null,null,null,"","//","//"]
[0,null,null,null,null,null,"","//","//"]
[0,null,null,null,null,null,"","//","//"]
[0,null,null,null,null,null,"","//","//"]
[0,null,null,null,null,null,"","//","//"]
[0,null,null,null,null,null,"","//","//"]
[0,null,null,null,null,null,"","//","//"]
[0,null,null,null,null,null,"","//","//"]
[0,null,null,null,null,null,"","//","//"]
[0,null,null,null,null,null,"","//","//"]
[0,null,null,null,null,null,"","//","//"]
[0,null,null,null,null,null,"","//","//"]
[0,null,null,null,null,null,"","//","//"]
[0,null,null,null,null,null,"","//","//"]
[0,null,null,null,null,null,"","//","//"]
[0,null,null,null,null,null,"","//","//"]
[0,null,null,null,null,null,"","//","//"]
[0,null,null,null,null,null,"","//","//"]
[0,null,null,null,null,null,"","//","//"]
[0,null,null,null,null,null,"","//","//"]
[0,null,null,null,null,null,"","//","//"]
[0,null,null,null,null,null,"","//","//"]
[0,null,null,null,null,null,"","//","//"]
[0,null,null,null,null,null,"","//","//"]
[0,null,null,null,null,null,"","//","//"]
[0,null,null,null,null,null,"","//","//"]
[0,null,null,null,null,null,"","//","//"]
[0,null,null,null,null,null,"","//","//"]
[0,null,null,null,null,null,"","//","//"]
[0,null,null,null,null,null,"","//","//"]
[0,null,null,null,null,null,"","//","//"]
[0,null,null,null,null,null,"","//","//"]
[0,null,null,null,null,null,"","//","//"]
[0,null,null,null,null,null,"","//","//"]
[0,null,null,null,null,null,"","//","//"]
[0,null,null,null,null,null,"","//","//"]
[0,null,null,null,null,null,"","//","//"]
[0,null,null,null,null,null,"","//","//"]
[0,null,null,null,null,null,"","//","//"]
[0,null,null,null,null,null,"","//","//"]
[0,null,null,null,null,null,"","//","//"]
[0,null,null,null,null,null,"","//","//"]
[0,null,null,null,null,null,"","//","//"]
[0,null,null,null,null,null,"",{"$f":"IF(OR($G6144=\"NTSI\",$G6144=\"TTSI\"),$E6144,LEFT($E6144,4)&\"/\"&MID($E6144,5,2)&\"/\"&RIGHT($E6144,2))","v":"//"},{"$f":"IF(OR($G6144=\"NTSI\",$G6144=\"TTSI\"),$F6144,LEFT($F6144,4)&\"/\"&MID($F6144,5,2)&\"/\"&RIGHT($F6144,2))","v":"//"}]
[0,null,null,null,null,null,"","//","//"]
[0,null,null,null,null,null,"","//","//"]
[0,null,null,null,null,null,"","//","//"]
[0,null,null,null,null,null,"","//","//"]
[{"$f":"IF(RIGHT(B6149,1)=\"H\",LEFT(B6149,11)&\"B\",B6149)","v":0},null,null,null,null,null,{"$f":"MID(C6149,4,4)","v":""},"//","//"]
[0,null,null,null,null,null,"","//","//"]
[0,null,null,null,null,null,"","//","//"]
[0,null,null,null,null,null,"","//","//"]
[0,null,null,null,null,null,"","//","//"]
[0,null,null,null,null,null,"","//","//"]
[0,null,null,null,null,null,"","//","//"]
[0,null,null,null,null,null,"","//","//"]
[0,null,null,null,null,null,"","//","//"]
[0,null,null,null,null,null,"","//","//"]
[0,null,null,null,null,null,"","//","//"]
[0,null,null,null,null,null,"","//","//"]
[0,null,null,null,null,null,"","//","//"]
[0,null,null,null,null,null,"","//","//"]
[0,null,null,null,null,null,"","//","//"]
[0,null,null,null,null,null,"","//","//"]
[0,null,null,null,null,null,"","//","//"]
[0,null,null,null,null,null,"","//","//"]
[0,null,null,null,null,null,"","//","//"]
[0,null,null,null,null,null,"","//","//"]
[0,null,null,null,null,null,"","//","//"]
[0,null,null,null,null,null,"","//","//"]
[0,null,null,null,null,null,"","//","//"]
[0,null,null,null,null,null,"","//","//"]
[0,null,null,null,null,null,"","//","//"]
[0,null,null,null,null,null,"","//","//"]
[0,null,null,null,null,null,"","//","//"]
[0,null,null,null,null,null,"","//","//"]
[0,null,null,null,null,null,"","//","//"]
[0,null,null,null,null,null,"","//","//"]
[0,null,null,null,null,null,"","//","//"]
[0,null,null,null,null,null,"","//","//"]
[0,null,null,null,null,null,"","//","//"]
[0,null,null,null,null,null,"","//","//"]
[0,null,null,null,null,null,"","//","//"]
[0,null,null,null,null,null,"","//","//"]
[0,null,null,null,null,null,"","//","//"]
[0,null,null,null,null,null,"","//","//"]
[0,null,null,null,null,null,"","//","//"]
[0,null,null,null,null,null,"","//","//"]
[0,null,null,null,null,null,"","//","//"]
[0,null,null,null,null,null,"","//","//"]
[0,null,null,null,null,null,"","//","//"]
[0,null,null,null,null,null,"","//","//"]
[0,null,null,null,null,null,"","//","//"]
[0,null,null,null,null,null,"","//","//"]
[0,null,null,null,null,null,"","//","//"]
[0,null,null,null,null,null,"","//","//"]
[0,null,null,null,null,null,"","//","//"]
[0,null,null,null,null,null,"","//","//"]
[0,null,null,null,null,null,"","//","//"]
[0,null,null,null,null,null,"","//","//"]
[0,null,null,null,null,null,"","//","//"]
[0,null,null,null,null,null,"","//","//"]
[0,null,null,null,null,null,"","//","//"]
[0,null,null,null,null,null,"","//","//"]
[0,null,null,null,null,null,"","//","//"]
[0,null,null,null,null,null,"","//","//"]
[0,null,null,null,null,null,"","//","//"]
[0,null,null,null,null,null,"",{"$f":"IF(OR($G6208=\"NTSI\",$G6208=\"TTSI\"),$E6208,LEFT($E6208,4)&\"/\"&MID($E6208,5,2)&\"/\"&RIGHT($E6208,2))","v":"//"},{"$f":"IF(OR($G6208=\"NTSI\",$G6208=\"TTSI\"),$F6208,LEFT($F6208,4)&\"/\"&MID($F6208,5,2)&\"/\"&RIGHT($F6208,2))","v":"//"}]
[0,null,null,null,null,null,"","//","//"]
[0,null,null,null,null,null,"","//","//"]
[0,null,null,null,null,null,"","//","//"]
[0,null,null,null,null,null,"","//","//"]
[{"$f":"IF(RIGHT(B6213,1)=\"H\",LEFT(B6213,11)&\"B\",B6213)","v":0},null,null,null,null,null,{"$f":"MID(C6213,4,4)","v":""},"//","//"]
[0,null,null,null,null,null,"","//","//"]
[0,null,null,null,null,null,"","//","//"]
[0,null,null,null,null,null,"","//","//"]
[0,null,null,null,null,null,"","//","//"]
[0,null,null,null,null,null,"","//","//"]
[0,null,null,null,null,null,"","//","//"]
[0,null,null,null,null,null,"","//","//"]
[0,null,null,null,null,null,"","//","//"]
[0,null,null,null,null,null,"","//","//"]
[0,null,null,null,null,null,"","//","//"]
[0,null,null,null,null,null,"","//","//"]
[0,null,null,null,null,null,"","//","//"]
[0,null,null,null,null,null,"","//","//"]
[0,null,null,null,null,null,"","//","//"]
[0,null,null,null,null,null,"","//","//"]
[0,null,null,null,null,null,"","//","//"]
[0,null,null,null,null,null,"","//","//"]
[0,null,null,null,null,null,"","//","//"]
[0,null,null,null,null,null,"","//","//"]
[0,null,null,null,null,null,"","//","//"]
[0,null,null,null,null,null,"","//","//"]
[0,null,null,null,null,null,"","//","//"]
[0,null,null,null,null,null,"","//","//"]
[0,null,null,null,null,null,"","//","//"]
[0,null,null,null,null,null,"","//","//"]
[0,null,null,null,null,null,"","//","//"]
[0,null,null,null,null,null,"","//","//"]
[0,null,null,null,null,null,"","//","//"]
[0,null,null,null,null,null,"","//","//"]
[0,null,null,null,null,null,"","//","//"]
[0,null,null,null,null,null,"","//","//"]
[0,null,null,null,null,null,"","//","//"]
[0,null,null,null,null,null,"","//","//"]
[0,null,null,null,null,null,"","//","//"]
[0,null,null,null,null,null,"","//","//"]
[0,null,null,null,null,null,"","//","//"]
[0,null,null,null,null,null,"","//","//"]
[0,null,null,null,null,null,"","//","//"]
[0,null,null,null,null,null,"","//","//"]
[0,null,null,null,null,null,"","//","//"]
[0,null,null,null,null,null,"","//","//"]
[0,null,null,null,null,null,"","//","//"]
[0,null,null,null,null,null,"","//","//"]
[0,null,null,null,null,null,"","//","//"]
[0,null,null,null,null,null,"","//","//"]
[0,null,null,null,null,null,"","//","//"]
[0,null,null,null,null,null,"","//","//"]
[0,null,null,null,null,null,"","//","//"]
[0,null,null,null,null,null,"","//","//"]
[0,null,null,null,null,null,"","//","//"]
[0,null,null,null,null,null,"","//","//"]
[0,null,null,null,null,null,"","//","//"]
[0,null,null,null,null,null,"","//","//"]
[0,null,null,null,null,null,"","//","//"]
[0,null,null,null,null,null,"","//","//"]
[0,null,null,null,null,null,"","//","//"]
[0,null,null,null,null,null,"","//","//"]
[0,null,null,null,null,null,"","//","//"]
[0,null,null,null,null,null,"",{"$f":"IF(OR($G6272=\"NTSI\",$G6272=\"TTSI\"),$E6272,LEFT($E6272,4)&\"/\"&MID($E6272,5,2)&\"/\"&RIGHT($E6272,2))","v":"//"},{"$f":"IF(OR($G6272=\"NTSI\",$G6272=\"TTSI\"),$F6272,LEFT($F6272,4)&\"/\"&MID($F6272,5,2)&\"/\"&RIGHT($F6272,2))","v":"//"}]
[0,null,null,null,null,null,"","//","//"]
[0,null,null,null,null,null,"","//","//"]
[0,null,null,null,null,null,"","//","//"]
[0,null,null,null,null,null,"","//","//"]
[{"$f":"IF(RIGHT(B6277,1)=\"H\",LEFT(B6277,11)&\"B\",B6277)","v":0},null,null,null,null,null,{"$f":"MID(C6277,4,4)","v":""},"//","//"]
[0,null,null,null,null,null,"","//","//"]
[0,null,null,null,null,null,"","//","//"]
[0,null,null,null,null,null,"","//","//"]
[0,null,null,null,null,null,"","//","//"]
[0,null,null,null,null,null,"","//","//"]
[0,null,null,null,null,null,"","//","//"]
[0,null,null,null,null,null,"","//","//"]
[0,null,null,null,null,null,"","//","//"]
[0,null,null,null,null,null,"","//","//"]
[0,null,null,null,null,null,"","//","//"]
[0,null,null,null,null,null,"","//","//"]
[0,null,null,null,null,null,"","//","//"]
[0,null,null,null,null,null,"","//","//"]
[0,null,null,null,null,null,"","//","//"]
[0,null,null,null,null,null,"","//","//"]
[0,null,null,null,null,null,"","//","//"]
[0,null,null,null,null,null,"","//","//"]
[0,null,null,null,null,null,"","//","//"]
[0,null,null,null,null,null,"","//","//"]
[0,null,null,null,null,null,"","//","//"]
[0,null,null,null,null,null,"","//","//"]
[0,null,null,null,null,null,"","//","//"]
[0,null,null,null,null,null,"","//","//"]
[0,null,null,null,null,null,"","//","//"]
[0,null,null,null,null,null,"","//","//"]
[0,null,null,null,null,null,"","//","//"]
[0,null,null,null,null,null,"","//","//"]
[0,null,null,null,null,null,"","//","//"]
[0,null,null,null,null,null,"","//","//"]
[0,null,null,null,null,null,"","//","//"]
[0,null,null,null,null,null,"","//","//"]
[0,null,null,null,null,null,"","//","//"]
[0,null,null,null,null,null,"","//","//"]
[0,null,null,null,null,null,"","//","//"]
[0,null,null,null,null,null,"","//","//"]
[0,null,null,null,null,null,"","//","//"]
[0,null,null,null,null,null,"","//","//"]
[0,null,null,null,null,null,"","//","//"]
[0,null,null,null,null,null,"","//","//"]
[0,null,null,null,null,null,"","//","//"]
[0,null,null,null,null,null,"","//","//"]
[0,null,null,null,null,null,"","//","//"]
[0,null,null,null,null,null,"","//","//"]
[0,null,null,null,null,null,"","//","//"]
[0,null,null,null,null,null,"","//","//"]
[0,null,null,null,null,null,"","//","//"]
[0,null,null,null,null,null,"","//","//"]
[0,null,null,null,null,null,"","//","//"]
[0,null,null,null,null,null,"","//","//"]
[0,null,null,null,null,null,"","//","//"]
[0,null,null,null,null,null,"","//","//"]
[0,null,null,null,null,null,"","//","//"]
[0,null,null,null,null,null,"","//","//"]
[0,null,null,null,null,null,"","//","//"]
[0,null,null,null,null,null,"","//","//"]
[0,null,null,null,null,null,"","//","//"]
[0,null,null,null,null,null,"","//","//"]
[0,null,null,null,null,null,"","//","//"]
[0,null,null,null,null,null,"",{"$f":"IF(OR($G6336=\"NTSI\",$G6336=\"TTSI\"),$E6336,LEFT($E6336,4)&\"/\"&MID($E6336,5,2)&\"/\"&RIGHT($E6336,2))","v":"//"},{"$f":"IF(OR($G6336=\"NTSI\",$G6336=\"TTSI\"),$F6336,LEFT($F6336,4)&\"/\"&MID($F6336,5,2)&\"/\"&RIGHT($F6336,2))","v":"//"}]
[0,null,null,null,null,null,"","//","//"]
[0,null,null,null,null,null,"","//","//"]
[0,null,null,null,null,null,"","//","//"]
[0,null,null,null,null,null,"","//","//"]
[{"$f":"IF(RIGHT(B6341,1)=\"H\",LEFT(B6341,11)&\"B\",B6341)","v":0},null,null,null,null,null,{"$f":"MID(C6341,4,4)","v":""},"//","//"]
[0,null,null,null,null,null,"","//","//"]
[0,null,null,null,null,null,"","//","//"]
[0,null,null,null,null,null,"","//","//"]
[0,null,null,null,null,null,"","//","//"]
[0,null,null,null,null,null,"","//","//"]
[0,null,null,null,null,null,"","//","//"]
[0,null,null,null,null,null,"","//","//"]
[0,null,null,null,null,null,"","//","//"]
[0,null,null,null,null,null,"","//","//"]
[0,null,null,null,null,null,"","//","//"]
[0,null,null,null,null,null,"","//","//"]
[0,null,null,null,null,null,"","//","//"]
[0,null,null,null,null,null,"","//","//"]
[0,null,null,null,null,null,"","//","//"]
[0,null,null,null,null,null,"","//","//"]
[0,null,null,null,null,null,"","//","//"]
[0,null,null,null,null,null,"","//","//"]
[0,null,null,null,null,null,"","//","//"]
[0,null,null,null,null,null,"","//","//"]
[0,null,null,null,null,null,"","//","//"]
[0,null,null,null,null,null,"","//","//"]
[0,null,null,null,null,null,"","//","//"]
[0,null,null,null,null,null,"","//","//"]
[0,null,null,null,null,null,"","//","//"]
[0,null,null,null,null,null,"","//","//"]
[0,null,null,null,null,null,"","//","//"]
[0,null,null,null,null,null,"","//","//"]
[0,null,null,null,null,null,"","//","//"]
[0,null,null,null,null,null,"","//","//"]
[0,null,null,null,null,null,"","//","//"]
[0,null,null,null,null,null,"","//","//"]
[0,null,null,null,null,null,"","//","//"]
[0,null,null,null,null,null,"","//","//"]
[0,null,null,null,null,null,"","//","//"]
[0,null,null,null,null,null,"","//","//"]
[0,null,null,null,null,null,"","//","//"]
[0,null,null,null,null,null,"","//","//"]
[0,null,null,null,null,null,"","//","//"]
[0,null,null,null,null,null,"","//","//"]
[0,null,null,null,null,null,"","//","//"]
[0,null,null,null,null,null,"","//","//"]
[0,null,null,null,null,null,"","//","//"]
[0,null,null,null,null,null,"","//","//"]
[0,null,null,null,null,null,"","//","//"]
[0,null,null,null,null,null,"","//","//"]
[0,null,null,null,null,null,"","//","//"]
[0,null,null,null,null,null,"","//","//"]
[0,null,null,null,null,null,"","//","//"]
[0,null,null,null,null,null,"","//","//"]
[0,null,null,null,null,null,"","//","//"]
[0,null,null,null,null,null,"","//","//"]
[0,null,null,null,null,null,"","//","//"]
[0,null,null,null,null,null,"","//","//"]
[0,null,null,null,null,null,"","//","//"]
[0,null,null,null,null,null,"","//","//"]
[0,null,null,null,null,null,"","//","//"]
[0,null,null,null,null,null,"","//","//"]
[0,null,null,null,null,null,"","//","//"]
[0,null,null,null,null,null,"",{"$f":"IF(OR($G6400=\"NTSI\",$G6400=\"TTSI\"),$E6400,LEFT($E6400,4)&\"/\"&MID($E6400,5,2)&\"/\"&RIGHT($E6400,2))","v":"//"},{"$f":"IF(OR($G6400=\"NTSI\",$G6400=\"TTSI\"),$F6400,LEFT($F6400,4)&\"/\"&MID($F6400,5,2)&\"/\"&RIGHT($F6400,2))","v":"//"}]
[0,null,null,null,null,null,"","//","//"]
[0,null,null,null,null,null,"","//","//"]
[0,null,null,null,null,null,"","//","//"]
[0,null,null,null,null,null,"","//","//"]
[{"$f":"IF(RIGHT(B6405,1)=\"H\",LEFT(B6405,11)&\"B\",B6405)","v":0},null,null,null,null,null,{"$f":"MID(C6405,4,4)","v":""},"//","//"]
[0,null,null,null,null,null,"","//","//"]
[0,null,null,null,null,null,"","//","//"]
[0,null,null,null,null,null,"","//","//"]
[0,null,null,null,null,null,"","//","//"]
[0,null,null,null,null,null,"","//","//"]
[0,null,null,null,null,null,"","//","//"]
[0,null,null,null,null,null,"","//","//"]
[0,null,null,null,null,null,"","//","//"]
[0,null,null,null,null,null,"","//","//"]
[0,null,null,null,null,null,"","//","//"]
[0,null,null,null,null,null,"","//","//"]
[0,null,null,null,null,null,"","//","//"]
[0,null,null,null,null,null,"","//","//"]
[0,null,null,null,null,null,"","//","//"]
[0,null,null,null,null,null,"","//","//"]
[0,null,null,null,null,null,"","//","//"]
[0,null,null,null,null,null,"","//","//"]
[0,null,null,null,null,null,"","//","//"]
[0,null,null,null,null,null,"","//","//"]
[0,null,null,null,null,null,"","//","//"]
[0,null,null,null,null,null,"","//","//"]
[0,null,null,null,null,null,"","//","//"]
[0,null,null,null,null,null,"","//","//"]
[0,null,null,null,null,null,"","//","//"]
[0,null,null,null,null,null,"","//","//"]
[0,null,null,null,null,null,"","//","//"]
[0,null,null,null,null,null,"","//","//"]
[0,null,null,null,null,null,"","//","//"]
[0,null,null,null,null,null,"","//","//"]
[0,null,null,null,null,null,"","//","//"]
[0,null,null,null,null,null,"","//","//"]
[0,null,null,null,null,null,"","//","//"]
[0,null,null,null,null,null,"","//","//"]
[0,null,null,null,null,null,"","//","//"]
[0,null,null,null,null,null,"","//","//"]
[0,null,null,null,null,null,"","//","//"]
[0,null,null,null,null,null,"","//","//"]
[0,null,null,null,null,null,"","//","//"]
[0,null,null,null,null,null,"","//","//"]
[0,null,null,null,null,null,"","//","//"]
[0,null,null,null,null,null,"","//","//"]
[0,null,null,null,null,null,"","//","//"]
[0,null,null,null,null,null,"","//","//"]
[0,null,null,null,null,null,"","//","//"]
[0,null,null,null,null,null,"","//","//"]
[0,null,null,null,null,null,"","//","//"]
[0,null,null,null,null,null,"","//","//"]
[0,null,null,null,null,null,"","//","//"]
[0,null,null,null,null,null,"","//","//"]
[0,null,null,null,null,null,"","//","//"]
[0,null,null,null,null,null,"","//","//"]
[0,null,null,null,null,null,"","//","//"]
[0,null,null,null,null,null,"","//","//"]
[0,null,null,null,null,null,"","//","//"]
[0,null,null,null,null,null,"","//","//"]
[0,null,null,null,null,null,"","//","//"]
[0,null,null,null,null,null,"","//","//"]
[0,null,null,null,null,null,"","//","//"]
[0,null,null,null,null,null,"",{"$f":"IF(OR($G6464=\"NTSI\",$G6464=\"TTSI\"),$E6464,LEFT($E6464,4)&\"/\"&MID($E6464,5,2)&\"/\"&RIGHT($E6464,2))","v":"//"},{"$f":"IF(OR($G6464=\"NTSI\",$G6464=\"TTSI\"),$F6464,LEFT($F6464,4)&\"/\"&MID($F6464,5,2)&\"/\"&RIGHT($F6464,2))","v":"//"}]
[0,null,null,null,null,null,"","//","//"]
[0,null,null,null,null,null,"","//","//"]
[0,null,null,null,null,null,"","//","//"]
[0,null,null,null,null,null,"","//","//"]
[{"$f":"IF(RIGHT(B6469,1)=\"H\",LEFT(B6469,11)&\"B\",B6469)","v":0},null,null,null,null,null,{"$f":"MID(C6469,4,4)","v":""},"//","//"]
[0,null,null,null,null,null,"","//","//"]
[0,null,null,null,null,null,"","//","//"]
[0,null,null,null,null,null,"","//","//"]
[0,null,null,null,null,null,"","//","//"]
[0,null,null,null,null,null,"","//","//"]
[0,null,null,null,null,null,"","//","//"]
[0,null,null,null,null,null,"","//","//"]
[0,null,null,null,null,null,"","//","//"]
[0,null,null,null,null,null,"","//","//"]
[0,null,null,null,null,null,"","//","//"]
[0,null,null,null,null,null,"","//","//"]
[0,null,null,null,null,null,"","//","//"]
[0,null,null,null,null,null,"","//","//"]
[0,null,null,null,null,null,"","//","//"]
[0,null,null,null,null,null,"","//","//"]
[0,null,null,null,null,null,"","//","//"]
[0,null,null,null,null,null,"","//","//"]
[0,null,null,null,null,null,"","//","//"]
[0,null,null,null,null,null,"","//","//"]
[0,null,null,null,null,null,"","//","//"]
[0,null,null,null,null,null,"","//","//"]
[0,null,null,null,null,null,"","//","//"]
[0,null,null,null,null,null,"","//","//"]
[0,null,null,null,null,null,"","//","//"]
[0,null,null,null,null,null,"","//","//"]
[0,null,null,null,null,null,"","//","//"]
[0,null,null,null,null,null,"","//","//"]
[0,null,null,null,null,null,"","//","//"]
[0,null,null,null,null,null,"","//","//"]
[0,null,null,null,null,null,"","//","//"]
[0,null,null,null,null,null,"","//","//"]
[0,null,null,null,null,null,"","//","//"]
[0,null,null,null,null,null,"","//","//"]
[0,null,null,null,null,null,"","//","//"]
[0,null,null,null,null,null,"","//","//"]
[0,null,null,null,null,null,"","//","//"]
[0,null,null,null,null,null,"","//","//"]
[0,null,null,null,null,null,"","//","//"]
[0,null,null,null,null,null,"","//","//"]
[0,null,null,null,null,null,"","//","//"]
[0,null,null,null,null,null,"","//","//"]
[0,null,null,null,null,null,"","//","//"]
[0,null,null,null,null,null,"","//","//"]
[0,null,null,null,null,null,"","//","//"]
[0,null,null,null,null,null,"","//","//"]
[0,null,null,null,null,null,"","//","//"]
[0,null,null,null,null,null,"","//","//"]
[0,null,null,null,null,null,"","//","//"]
[0,null,null,null,null,null,"","//","//"]
[0,null,null,null,null,null,"","//","//"]
[0,null,null,null,null,null,"","//","//"]
[0,null,null,null,null,null,"","//","//"]
[0,null,null,null,null,null,"","//","//"]
[0,null,null,null,null,null,"","//","//"]
[0,null,null,null,null,null,"","//","//"]
[0,null,null,null,null,null,"","//","//"]
[0,null,null,null,null,null,"","//","//"]
[0,null,null,null,null,null,"","//","//"]
[0,null,null,null,null,null,"",{"$f":"IF(OR($G6528=\"NTSI\",$G6528=\"TTSI\"),$E6528,LEFT($E6528,4)&\"/\"&MID($E6528,5,2)&\"/\"&RIGHT($E6528,2))","v":"//"},{"$f":"IF(OR($G6528=\"NTSI\",$G6528=\"TTSI\"),$F6528,LEFT($F6528,4)&\"/\"&MID($F6528,5,2)&\"/\"&RIGHT($F6528,2))","v":"//"}]
[0,null,null,null,null,null,"","//","//"]
[0,null,null,null,null,null,"","//","//"]
[0,null,null,null,null,null,"","//","//"]
[0,null,null,null,null,null,"","//","//"]
[{"$f":"IF(RIGHT(B6533,1)=\"H\",LEFT(B6533,11)&\"B\",B6533)","v":0},null,null,null,null,null,{"$f":"MID(C6533,4,4)","v":""},"//","//"]
[0,null,null,null,null,null,"","//","//"]
[0,null,null,null,null,null,"","//","//"]
[0,null,null,null,null,null,"","//","//"]
[0,null,null,null,null,null,"","//","//"]
[0,null,null,null,null,null,"","//","//"]
[0,null,null,null,null,null,"","//","//"]
[0,null,null,null,null,null,"","//","//"]
[0,null,null,null,null,null,"","//","//"]
[0,null,null,null,null,null,"","//","//"]
[0,null,null,null,null,null,"","//","//"]
[0,null,null,null,null,null,"","//","//"]
[0,null,null,null,null,null,"","//","//"]
[0,null,null,null,null,null,"","//","//"]
[0,null,null,null,null,null,"","//","//"]
[0,null,null,null,null,null,"","//","//"]
[0,null,null,null,null,null,"","//","//"]
[0,null,null,null,null,null,"","//","//"]
[0,null,null,null,null,null,"","//","//"]
[0,null,null,null,null,null,"","//","//"]
[0,null,null,null,null,null,"","//","//"]
[0,null,null,null,null,null,"","//","//"]
[0,null,null,null,null,null,"","//","//"]
[0,null,null,null,null,null,"","//","//"]
[0,null,null,null,null,null,"","//","//"]
[0,null,null,null,null,null,"","//","//"]
[0,null,null,null,null,null,"","//","//"]
[0,null,null,null,null,null,"","//","//"]
[0,null,null,null,null,null,"","//","//"]
[0,null,null,null,null,null,"","//","//"]
[0,null,null,null,null,null,"","//","//"]
[0,null,null,null,null,null,"","//","//"]
[0,null,null,null,null,null,"","//","//"]
[0,null,null,null,null,null,"","//","//"]
[0,null,null,null,null,null,"","//","//"]
[0,null,null,null,null,null,"","//","//"]
[0,null,null,null,null,null,"","//","//"]
[0,null,null,null,null,null,"","//","//"]
[0,null,null,null,null,null,"","//","//"]
[0,null,null,null,null,null,"","//","//"]
[0,null,null,null,null,null,"","//","//"]
[0,null,null,null,null,null,"","//","//"]
[0,null,null,null,null,null,"","//","//"]
[0,null,null,null,null,null,"","//","//"]
[0,null,null,null,null,null,"","//","//"]
[0,null,null,null,null,null,"","//","//"]
[0,null,null,null,null,null,"","//","//"]
[0,null,null,null,null,null,"","//","//"]
[0,null,null,null,null,null,"","//","//"]
[0,null,null,null,null,null,"","//","//"]
[0,null,null,null,null,null,"","//","//"]
[0,null,null,null,null,null,"","//","//"]
[0,null,null,null,null,null,"","//","//"]
[0,null,null,null,null,null,"","//","//"]
[0,null,null,null,null,null,"","//","//"]
[0,null,null,null,null,null,"","//","//"]
[0,null,null,null,null,null,"","//","//"]
[0,null,null,null,null,null,"","//","//"]
[0,null,null,null,null,null,"","//","//"]
[0,null,null,null,null,null,"",{"$f":"IF(OR($G6592=\"NTSI\",$G6592=\"TTSI\"),$E6592,LEFT($E6592,4)&\"/\"&MID($E6592,5,2)&\"/\"&RIGHT($E6592,2))","v":"//"},{"$f":"IF(OR($G6592=\"NTSI\",$G6592=\"TTSI\"),$F6592,LEFT($F6592,4)&\"/\"&MID($F6592,5,2)&\"/\"&RIGHT($F6592,2))","v":"//"}]
[0,null,null,null,null,null,"","//","//"]
[0,null,null,null,null,null,"","//","//"]
[0,null,null,null,null,null,"","//","//"]
[0,null,null,null,null,null,"","//","//"]
[{"$f":"IF(RIGHT(B6597,1)=\"H\",LEFT(B6597,11)&\"B\",B6597)","v":0},null,null,null,null,null,{"$f":"MID(C6597,4,4)","v":""},"//","//"]
[0,null,null,null,null,null,"","//","//"]
[0,null,null,null,null,null,"","//","//"]
[0,null,null,null,null,null,"","//","//"]
[0,null,null,null,null,null,"","//","//"]
[0,null,null,null,null,null,"","//","//"]
[0,null,null,null,null,null,"","//","//"]
[0,null,null,null,null,null,"","//","//"]
[0,null,null,null,null,null,"","//","//"]
[0,null,null,null,null,null,"","//","//"]
[0,null,null,null,null,null,"","//","//"]
[0,null,null,null,null,null,"","//","//"]
[0,null,null,null,null,null,"","//","//"]
[0,null,null,null,null,null,"","//","//"]
[0,null,null,null,null,null,"","//","//"]
[0,null,null,null,null,null,"","//","//"]
[0,null,null,null,null,null,"","//","//"]
[0,null,null,null,null,null,"","//","//"]
[0,null,null,null,null,null,"","//","//"]
[0,null,null,null,null,null,"","//","//"]
[0,null,null,null,null,null,"","//","//"]
[0,null,null,null,null,null,"","//","//"]
[0,null,null,null,null,null,"","//","//"]
[0,null,null,null,null,null,"","//","//"]
[0,null,null,null,null,null,"","//","//"]
[0,null,null,null,null,null,"","//","//"]
[0,null,null,null,null,null,"","//","//"]
[0,null,null,null,null,null,"","//","//"]
[0,null,null,null,null,null,"","//","//"]
[0,null,null,null,null,null,"","//","//"]
[0,null,null,null,null,null,"","//","//"]
[0,null,null,null,null,null,"","//","//"]
[0,null,null,null,null,null,"","//","//"]
[0,null,null,null,null,null,"","//","//"]
[0,null,null,null,null,null,"","//","//"]
[0,null,null,null,null,null,"","//","//"]
[0,null,null,null,null,null,"","//","//"]
[0,null,null,null,null,null,"","//","//"]
[0,null,null,null,null,null,"","//","//"]
[0,null,null,null,null,null,"","//","//"]
[0,null,null,null,null,null,"","//","//"]
[0,null,null,null,null,null,"","//","//"]
[0,null,null,null,null,null,"","//","//"]
[0,null,null,null,null,null,"","//","//"]
[0,null,null,null,null,null,"","//","//"]
[0,null,null,null,null,null,"","//","//"]
[0,null,null,null,null,null,"","//","//"]
[0,null,null,null,null,null,"","//","//"]
[0,null,null,null,null,null,"","//","//"]
[0,null,null,null,null,null,"","//","//"]
[0,null,null,null,null,null,"","//","//"]
[0,null,null,null,null,null,"","//","//"]
[0,null,null,null,null,null,"","//","//"]
[0,null,null,null,null,null,"","//","//"]
[0,null,null,null,null,null,"","//","//"]
[0,null,null,null,null,null,"","//","//"]
[0,null,null,null,null,null,"","//","//"]
[0,null,null,null,null,null,"","//","//"]
[0,null,null,null,null,null,"","//","//"]
[0,null,null,null,null,null,"",{"$f":"IF(OR($G6656=\"NTSI\",$G6656=\"TTSI\"),$E6656,LEFT($E6656,4)&\"/\"&MID($E6656,5,2)&\"/\"&RIGHT($E6656,2))","v":"//"},{"$f":"IF(OR($G6656=\"NTSI\",$G6656=\"TTSI\"),$F6656,LEFT($F6656,4)&\"/\"&MID($F6656,5,2)&\"/\"&RIGHT($F6656,2))","v":"//"}]
[0,null,null,null,null,null,"","//","//"]
[0,null,null,null,null,null,"","//","//"]
[0,null,null,null,null,null,"","//","//"]
[0,null,null,null,null,null,"","//","//"]
[{"$f":"IF(RIGHT(B6661,1)=\"H\",LEFT(B6661,11)&\"B\",B6661)","v":0},null,null,null,null,null,{"$f":"MID(C6661,4,4)","v":""},"//","//"]
[0,null,null,null,null,null,"","//","//"]
[0,null,null,null,null,null,"","//","//"]
[0,null,null,null,null,null,"","//","//"]
[0,null,null,null,null,null,"","//","//"]
[0,null,null,null,null,null,"","//","//"]
[0,null,null,null,null,null,"","//","//"]
[0,null,null,null,null,null,"","//","//"]
[0,null,null,null,null,null,"","//","//"]
[0,null,null,null,null,null,"","//","//"]
[0,null,null,null,null,null,"","//","//"]
[0,null,null,null,null,null,"","//","//"]
[0,null,null,null,null,null,"","//","//"]
[0,null,null,null,null,null,"","//","//"]
[0,null,null,null,null,null,"","//","//"]
[0,null,null,null,null,null,"","//","//"]
[0,null,null,null,null,null,"","//","//"]
[0,null,null,null,null,null,"","//","//"]
[0,null,null,null,null,null,"","//","//"]
[0,null,null,null,null,null,"","//","//"]
[0,null,null,null,null,null,"","//","//"]
[0,null,null,null,null,null,"","//","//"]
[0,null,null,null,null,null,"","//","//"]
[0,null,null,null,null,null,"","//","//"]
[0,null,null,null,null,null,"","//","//"]
[0,null,null,null,null,null,"","//","//"]
[0,null,null,null,null,null,"","//","//"]
[0,null,null,null,null,null,"","//","//"]
[0,null,null,null,null,null,"","//","//"]
[0,null,null,null,null,null,"","//","//"]
[0,null,null,null,null,null,"","//","//"]
[0,null,null,null,null,null,"","//","//"]
[0,null,null,null,null,null,"","//","//"]
[0,null,null,null,null,null,"","//","//"]
[0,null,null,null,null,null,"","//","//"]
[0,null,null,null,null,null,"","//","//"]
[0,null,null,null,null,null,"","//","//"]
[0,null,null,null,null,null,"","//","//"]
[0,null,null,null,null,null,"","//","//"]
[0,null,null,null,null,null,"","//","//"]
[0,null,null,null,null,null,"","//","//"]
[0,null,null,null,null,null,"","//","//"]
[0,null,null,null,null,null,"","//","//"]
[0,null,null,null,null,null,"","//","//"]
[0,null,null,null,null,null,"","//","//"]
[0,null,null,null,null,null,"","//","//"]
[0,null,null,null,null,null,"","//","//"]
[0,null,null,null,null,null,"","//","//"]
[0,null,null,null,null,null,"","//","//"]
[0,null,null,null,null,null,"","//","//"]
[0,null,null,null,null,null,"","//","//"]
[0,null,null,null,null,null,"","//","//"]
[0,null,null,null,null,null,"","//","//"]
[0,null,null,null,null,null,"","//","//"]
[0,null,null,null,null,null,"","//","//"]
[0,null,null,null,null,null,"","//","//"]
[0,null,null,null,null,null,"","//","//"]
[0,null,null,null,null,null,"","//","//"]
[0,null,null,null,null,null,"","//","//"]
[0,null,null,null,null,null,"",{"$f":"IF(OR($G6720=\"NTSI\",$G6720=\"TTSI\"),$E6720,LEFT($E6720,4)&\"/\"&MID($E6720,5,2)&\"/\"&RIGHT($E6720,2))","v":"//"},{"$f":"IF(OR($G6720=\"NTSI\",$G6720=\"TTSI\"),$F6720,LEFT($F6720,4)&\"/\"&MID($F6720,5,2)&\"/\"&RIGHT($F6720,2))","v":"//"}]
[0,null,null,null,null,null,"","//","//"]
[0,null,null,null,null,null,"","//","//"]
[0,null,null,null,null,null,"","//","//"]
[0,null,null,null,null,null,"","//","//"]
[{"$f":"IF(RIGHT(B6725,1)=\"H\",LEFT(B6725,11)&\"B\",B6725)","v":0},null,null,null,null,null,{"$f":"MID(C6725,4,4)","v":""},"//","//"]
[0,null,null,null,null,null,"","//","//"]
[0,null,null,null,null,null,"","//","//"]
[0,null,null,null,null,null,"","//","//"]
[0,null,null,null,null,null,"","//","//"]
[0,null,null,null,null,null,"","//","//"]
[0,null,null,null,null,null,"","//","//"]
[0,null,null,null,null,null,"","//","//"]
[0,null,null,null,null,null,"","//","//"]
[0,null,null,null,null,null,"","//","//"]
[0,null,null,null,null,null,"","//","//"]
[0,null,null,null,null,null,"","//","//"]
[0,null,null,null,null,null,"","//","//"]
[0,null,null,null,null,null,"","//","//"]
[0,null,null,null,null,null,"","//","//"]
[0,null,null,null,null,null,"","//","//"]
[0,null,null,null,null,null,"","//","//"]
[0,null,null,null,null,null,"","//","//"]
[0,null,null,null,null,null,"","//","//"]
[0,null,null,null,null,null,"","//","//"]
[0,null,null,null,null,null,"","//","//"]
[0,null,null,null,null,null,"","//","//"]
[0,null,null,null,null,null,"","//","//"]
[0,null,null,null,null,null,"","//","//"]
[0,null,null,null,null,null,"","//","//"]
[0,null,null,null,null,null,"","//","//"]
[0,null,null,null,null,null,"","//","//"]
[0,null,null,null,null,null,"","//","//"]
[0,null,null,null,null,null,"","//","//"]
[0,null,null,null,null,null,"","//","//"]
[0,null,null,null,null,null,"","//","//"]
[0,null,null,null,null,null,"","//","//"]
[0,null,null,null,null,null,"","//","//"]
[0,null,null,null,null,null,"","//","//"]
[0,null,null,null,null,null,"","//","//"]
[0,null,null,null,null,null,"","//","//"]
[0,null,null,null,null,null,"","//","//"]
[0,null,null,null,null,null,"","//","//"]
[0,null,null,null,null,null,"","//","//"]
[0,null,null,null,null,null,"","//","//"]
[0,null,null,null,null,null,"","//","//"]
[0,null,null,null,null,null,"","//","//"]
[0,null,null,null,null,null,"","//","//"]
[0,null,null,null,null,null,"","//","//"]
[0,null,null,null,null,null,"","//","//"]
[0,null,null,null,null,null,"","//","//"]
[0,null,null,null,null,null,"","//","//"]
[0,null,null,null,null,null,"","//","//"]
[0,null,null,null,null,null,"","//","//"]
[0,null,null,null,null,null,"","//","//"]
[0,null,null,null,null,null,"","//","//"]
[0,null,null,null,null,null,"","//","//"]
[0,null,null,null,null,null,"","//","//"]
[0,null,null,null,null,null,"","//","//"]
[0,null,null,null,null,null,"","//","//"]
[0,null,null,null,null,null,"","//","//"]
[0,null,null,null,null,null,"","//","//"]
[0,null,null,null,null,null,"","//","//"]
[0,null,null,null,null,null,"","//","//"]
[0,null,null,null,null,null,"",{"$f":"IF(OR($G6784=\"NTSI\",$G6784=\"TTSI\"),$E6784,LEFT($E6784,4)&\"/\"&MID($E6784,5,2)&\"/\"&RIGHT($E6784,2))","v":"//"},{"$f":"IF(OR($G6784=\"NTSI\",$G6784=\"TTSI\"),$F6784,LEFT($F6784,4)&\"/\"&MID($F6784,5,2)&\"/\"&RIGHT($F6784,2))","v":"//"}]
[0,null,null,null,null,null,"","//","//"]
[0,null,null,null,null,null,"","//","//"]
[0,null,null,null,null,null,"","//","//"]
[0,null,null,null,null,null,"","//","//"]
[{"$f":"IF(RIGHT(B6789,1)=\"H\",LEFT(B6789,11)&\"B\",B6789)","v":0},null,null,null,null,null,{"$f":"MID(C6789,4,4)","v":""},"//","//"]
[0,null,null,null,null,null,"","//","//"]
[0,null,null,null,null,null,"","//","//"]
[0,null,null,null,null,null,"","//","//"]
[0,null,null,null,null,null,"","//","//"]
[0,null,null,null,null,null,"","//","//"]
[0,null,null,null,null,null,"","//","//"]
[0,null,null,null,null,null,"","//","//"]
[0,null,null,null,null,null,"","//","//"]
[0,null,null,null,null,null,"","//","//"]
[0,null,null,null,null,null,"","//","//"]
[0,null,null,null,null,null,"","//","//"]
[0,null,null,null,null,null,"","//","//"]
[0,null,null,null,null,null,"","//","//"]
[0,null,null,null,null,null,"","//","//"]
[0,null,null,null,null,null,"","//","//"]
[0,null,null,null,null,null,"","//","//"]
[0,null,null,null,null,null,"","//","//"]
[0,null,null,null,null,null,"","//","//"]
[0,null,null,null,null,null,"","//","//"]
[0,null,null,null,null,null,"","//","//"]
[0,null,null,null,null,null,"","//","//"]
[0,null,null,null,null,null,"","//","//"]
[0,null,null,null,null,null,"","//","//"]
[0,null,null,null,null,null,"","//","//"]
[0,null,null,null,null,null,"","//","//"]
[0,null,null,null,null,null,"","//","//"]
[0,null,null,null,null,null,"","//","//"]
[0,null,null,null,null,null,"","//","//"]
[0,null,null,null,null,null,"","//","//"]
[0,null,null,null,null,null,"","//","//"]
[0,null,null,null,null,null,"","//","//"]
[0,null,null,null,null,null,"","//","//"]
[0,null,null,null,null,null,"","//","//"]
[0,null,null,null,null,null,"","//","//"]
[0,null,null,null,null,null,"","//","//"]
[0,null,null,null,null,null,"","//","//"]
[0,null,null,null,null,null,"","//","//"]
[0,null,null,null,null,null,"","//","//"]
[0,null,null,null,null,null,"","//","//"]
[0,null,null,null,null,null,"","//","//"]
[0,null,null,null,null,null,"","//","//"]
[0,null,null,null,null,null,"","//","//"]
[0,null,null,null,null,null,"","//","//"]
[0,null,null,null,null,null,"","//","//"]
[0,null,null,null,null,null,"","//","//"]
[0,null,null,null,null,null,"","//","//"]
[0,null,null,null,null,null,"","//","//"]
[0,null,null,null,null,null,"","//","//"]
[0,null,null,null,null,null,"","//","//"]
[0,null,null,null,null,null,"","//","//"]
[0,null,null,null,null,null,"","//","//"]
[0,null,null,null,null,null,"","//","//"]
[0,null,null,null,null,null,"","//","//"]
[0,null,null,null,null,null,"","//","//"]
[0,null,null,null,null,null,"","//","//"]
[0,null,null,null,null,null,"","//","//"]
[0,null,null,null,null,null,"","//","//"]
[0,null,null,null,null,null,"","//","//"]
[0,null,null,null,null,null,"",{"$f":"IF(OR($G6848=\"NTSI\",$G6848=\"TTSI\"),$E6848,LEFT($E6848,4)&\"/\"&MID($E6848,5,2)&\"/\"&RIGHT($E6848,2))","v":"//"},{"$f":"IF(OR($G6848=\"NTSI\",$G6848=\"TTSI\"),$F6848,LEFT($F6848,4)&\"/\"&MID($F6848,5,2)&\"/\"&RIGHT($F6848,2))","v":"//"}]
[0,null,null,null,null,null,"","//","//"]
[0,null,null,null,null,null,"","//","//"]
[0,null,null,null,null,null,"","//","//"]
[0,null,null,null,null,null,"","//","//"]
[{"$f":"IF(RIGHT(B6853,1)=\"H\",LEFT(B6853,11)&\"B\",B6853)","v":0},null,null,null,null,null,{"$f":"MID(C6853,4,4)","v":""},"//","//"]
[0,null,null,null,null,null,"","//","//"]
[0,null,null,null,null,null,"","//","//"]
[0,null,null,null,null,null,"","//","//"]
[0,null,null,null,null,null,"","//","//"]
[0,null,null,null,null,null,"","//","//"]
[0,null,null,null,null,null,"","//","//"]
[0,null,null,null,null,null,"","//","//"]
[0,null,null,null,null,null,"","//","//"]
[0,null,null,null,null,null,"","//","//"]
[0,null,null,null,null,null,"","//","//"]
[0,null,null,null,null,null,"","//","//"]
[0,null,null,null,null,null,"","//","//"]
[0,null,null,null,null,null,"","//","//"]
[0,null,null,null,null,null,"","//","//"]
[0,null,null,null,null,null,"","//","//"]
[0,null,null,null,null,null,"","//","//"]
[0,null,null,null,null,null,"","//","//"]
[0,null,null,null,null,null,"","//","//"]
[0,null,null,null,null,null,"","//","//"]
[0,null,null,null,null,null,"","//","//"]
[0,null,null,null,null,null,"","//","//"]
[0,null,null,null,null,null,"","//","//"]
[0,null,null,null,null,null,"","//","//"]
[0,null,null,null,null,null,"","//","//"]
[0,null,null,null,null,null,"","//","//"]
[0,null,null,null,null,null,"","//","//"]
[0,null,null,null,null,null,"","//","//"]
[0,null,null,null,null,null,"","//","//"]
[0,null,null,null,null,null,"","//","//"]
[0,null,null,null,null,null,"","//","//"]
[0,null,null,null,null,null,"","//","//"]
[0,null,null,null,null,null,"","//","//"]
[0,null,null,null,null,null,"","//","//"]
[0,null,null,null,null,null,"","//","//"]
[0,null,null,null,null,null,"","//","//"]
[0,null,null,null,null,null,"","//","//"]
[0,null,null,null,null,null,"","//","//"]
[0,null,null,null,null,null,"","//","//"]
[0,null,null,null,null,null,"","//","//"]
[0,null,null,null,null,null,"","//","//"]
[0,null,null,null,null,null,"","//","//"]
[0,null,null,null,null,null,"","//","//"]
[0,null,null,null,null,null,"","//","//"]
[0,null,null,null,null,null,"","//","//"]
[0,null,null,null,null,null,"","//","//"]
[0,null,null,null,null,null,"","//","//"]
[0,null,null,null,null,null,"","//","//"]
[0,null,null,null,null,null,"","//","//"]
[0,null,null,null,null,null,"","//","//"]
[0,null,null,null,null,null,"","//","//"]
[0,null,null,null,null,null,"","//","//"]
[0,null,null,null,null,null,"","//","//"]
[0,null,null,null,null,null,"","//","//"]
[0,null,null,null,null,null,"","//","//"]
[0,null,null,null,null,null,"","//","//"]
[0,null,null,null,null,null,"","//","//"]
[0,null,null,null,null,null,"","//","//"]
[0,null,null,null,null,null,"","//","//"]
[0,null,null,null,null,null,"",{"$f":"IF(OR($G6912=\"NTSI\",$G6912=\"TTSI\"),$E6912,LEFT($E6912,4)&\"/\"&MID($E6912,5,2)&\"/\"&RIGHT($E6912,2))","v":"//"},{"$f":"IF(OR($G6912=\"NTSI\",$G6912=\"TTSI\"),$F6912,LEFT($F6912,4)&\"/\"&MID($F6912,5,2)&\"/\"&RIGHT($F6912,2))","v":"//"}]
[0,null,null,null,null,null,"","//","//"]
[0,null,null,null,null,null,"","//","//"]
[0,null,null,null,null,null,"","//","//"]
[0,null,null,null,null,null,"","//","//"]
[{"$f":"IF(RIGHT(B6917,1)=\"H\",LEFT(B6917,11)&\"B\",B6917)","v":0},null,null,null,null,null,{"$f":"MID(C6917,4,4)","v":""},"//","//"]
[0,null,null,null,null,null,"","//","//"]
[0,null,null,null,null,null,"","//","//"]
[0,null,null,null,null,null,"","//","//"]
[0,null,null,null,null,null,"","//","//"]
[0,null,null,null,null,null,"","//","//"]
[0,null,null,null,null,null,"","//","//"]
[0,null,null,null,null,null,"","//","//"]
[0,null,null,null,null,null,"","//","//"]
[0,null,null,null,null,null,"","//","//"]
[0,null,null,null,null,null,"","//","//"]
[0,null,null,null,null,null,"","//","//"]
[0,null,null,null,null,null,"","//","//"]
[0,null,null,null,null,null,"","//","//"]
[0,null,null,null,null,null,"","//","//"]
[0,null,null,null,null,null,"","//","//"]
[0,null,null,null,null,null,"","//","//"]
[0,null,null,null,null,null,"","//","//"]
[0,null,null,null,null,null,"","//","//"]
[0,null,null,null,null,null,"","//","//"]
[0,null,null,null,null,null,"","//","//"]
[0,null,null,null,null,null,"","//","//"]
[0,null,null,null,null,null,"","//","//"]
[0,null,null,null,null,null,"","//","//"]
[0,null,null,null,null,null,"","//","//"]
[0,null,null,null,null,null,"","//","//"]
[0,null,null,null,null,null,"","//","//"]
[0,null,null,null,null,null,"","//","//"]
[0,null,null,null,null,null,"","//","//"]
[0,null,null,null,null,null,"","//","//"]
[0,null,null,null,null,null,"","//","//"]
[0,null,null,null,null,null,"","//","//"]
[0,null,null,null,null,null,"","//","//"]
[0,null,null,null,null,null,"","//","//"]
[0,null,null,null,null,null,"","//","//"]
[0,null,null,null,null,null,"","//","//"]
[0,null,null,null,null,null,"","//","//"]
[0,null,null,null,null,null,"","//","//"]
[0,null,null,null,null,null,"","//","//"]
[0,null,null,null,null,null,"","//","//"]
[0,null,null,null,null,null,"","//","//"]
[0,null,null,null,null,null,"","//","//"]
[0,null,null,null,null,null,"","//","//"]
[0,null,null,null,null,null,"","//","//"]
[0,null,null,null,null,null,"","//","//"]
[0,null,null,null,null,null,"","//","//"]
[0,null,null,null,null,null,"","//","//"]
[0,null,null,null,null,null,"","//","//"]
[0,null,null,null,null,null,"","//","//"]
[0,null,null,null,null,null,"","//","//"]
[0,null,null,null,null,null,"","//","//"]
[0,null,null,null,null,null,"","//","//"]
[0,null,null,null,null,null,"","//","//"]
[0,null,null,null,null,null,"","//","//"]
[0,null,null,null,null,null,"","//","//"]
[0,null,null,null,null,null,"","//","//"]
[0,null,null,null,null,null,"","//","//"]
[0,null,null,null,null,null,"","//","//"]
[0,null,null,null,null,null,"","//","//"]
[0,null,null,null,null,null,"",{"$f":"IF(OR($G6976=\"NTSI\",$G6976=\"TTSI\"),$E6976,LEFT($E6976,4)&\"/\"&MID($E6976,5,2)&\"/\"&RIGHT($E6976,2))","v":"//"},{"$f":"IF(OR($G6976=\"NTSI\",$G6976=\"TTSI\"),$F6976,LEFT($F6976,4)&\"/\"&MID($F6976,5,2)&\"/\"&RIGHT($F6976,2))","v":"//"}]
[0,null,null,null,null,null,"","//","//"]
[0,null,null,null,null,null,"","//","//"]
[0,null,null,null,null,null,"","//","//"]
[0,null,null,null,null,null,"","//","//"]
[{"$f":"IF(RIGHT(B6981,1)=\"H\",LEFT(B6981,11)&\"B\",B6981)","v":0},null,null,null,null,null,{"$f":"MID(C6981,4,4)","v":""},"//","//"]
[0,null,null,null,null,null,"","//","//"]
[0,null,null,null,null,null,"","//","//"]
[0,null,null,null,null,null,"","//","//"]
[0,null,null,null,null,null,"","//","//"]
[0,null,null,null,null,null,"","//","//"]
[0,null,null,null,null,null,"","//","//"]
[0,null,null,null,null,null,"","//","//"]
[0,null,null,null,null,null,"","//","//"]
[0,null,null,null,null,null,"","//","//"]
[0,null,null,null,null,null,"","//","//"]
[0,null,null,null,null,null,"","//","//"]
[0,null,null,null,null,null,"","//","//"]
[0,null,null,null,null,null,"","//","//"]
[0,null,null,null,null,null,"","//","//"]
[0,null,null,null,null,null,"","//","//"]
[0,null,null,null,null,null,"","//","//"]
[0,null,null,null,null,null,"","//","//"]
[0,null,null,null,null,null,"","//","//"]
[0,null,null,null,null,null,"","//","//"]
[0,null,null,null,null,null,"","//","//"]
[0,null,null,null,null,null,"","//","//"]
[0,null,null,null,null,null,"","//","//"]
[0,null,null,null,null,null,"","//","//"]
[0,null,null,null,null,null,"","//","//"]
[0,null,null,null,null,null,"","//","//"]
[0,null,null,null,null,null,"","//","//"]
[0,null,null,null,null,null,"","//","//"]
[0,null,null,null,null,null,"","//","//"]
[0,null,null,null,null,null,"","//","//"]
[0,null,null,null,null,null,"","//","//"]
[0,null,null,null,null,null,"","//","//"]
[0,null,null,null,null,null,"","//","//"]
[0,null,null,null,null,null,"","//","//"]
[0,null,null,null,null,null,"","//","//"]
[0,null,null,null,null,null,"","//","//"]
[0,null,null,null,null,null,"","//","//"]
[0,null,null,null,null,null,"","//","//"]
[0,null,null,null,null,null,"","//","//"]
[0,null,null,null,null,null,"","//","//"]
[0,null,null,null,null,null,"","//","//"]
[0,null,null,null,null,null,"","//","//"]
[0,null,null,null,null,null,"","//","//"]
[0,null,null,null,null,null,"","//","//"]
[0,null,null,null,null,null,"","//","//"]
[0,null,null,null,null,null,"","//","//"]
[0,null,null,null,null,null,"","//","//"]
[0,null,null,null,null,null,"","//","//"]
[0,null,null,null,null,null,"","//","//"]
[0,null,null,null,null,null,"","//","//"]
[0,null,null,null,null,null,"","//","//"]
[0,null,null,null,null,null,"","//","//"]
[0,null,null,null,null,null,"","//","//"]
[0,null,null,null,null,null,"","//","//"]
[0,null,null,null,null,null,"","//","//"]
[0,null,null,null,null,null,"","//","//"]
[0,null,null,null,null,null,"","//","//"]
[0,null,null,null,null,null,"","//","//"]
[0,null,null,null,null,null,"","//","//"]
[0,null,null,null,null,null,"",{"$f":"IF(OR($G7040=\"NTSI\",$G7040=\"TTSI\"),$E7040,LEFT($E7040,4)&\"/\"&MID($E7040,5,2)&\"/\"&RIGHT($E7040,2))","v":"//"},{"$f":"IF(OR($G7040=\"NTSI\",$G7040=\"TTSI\"),$F7040,LEFT($F7040,4)&\"/\"&MID($F7040,5,2)&\"/\"&RIGHT($F7040,2))","v":"//"}]
[0,null,null,null,null,null,"","//","//"]
[0,null,null,null,null,null,"","//","//"]
[0,null,null,null,null,null,"","//","//"]
[0,null,null,null,null,null,"","//","//"]
[{"$f":"IF(RIGHT(B7045,1)=\"H\",LEFT(B7045,11)&\"B\",B7045)","v":0},null,null,null,null,null,{"$f":"MID(C7045,4,4)","v":""},"//","//"]
[0,null,null,null,null,null,"","//","//"]
[0,null,null,null,null,null,"","//","//"]
[0,null,null,null,null,null,"","//","//"]
[0,null,null,null,null,null,"","//","//"]
[0,null,null,null,null,null,"","//","//"]
[0,null,null,null,null,null,"","//","//"]
[0,null,null,null,null,null,"","//","//"]
[0,null,null,null,null,null,"","//","//"]
[0,null,null,null,null,null,"","//","//"]
[0,null,null,null,null,null,"","//","//"]
[0,null,null,null,null,null,"","//","//"]
[0,null,null,null,null,null,"","//","//"]
[0,null,null,null,null,null,"","//","//"]
[0,null,null,null,null,null,"","//","//"]
[0,null,null,null,null,null,"","//","//"]
[0,null,null,null,null,null,"","//","//"]
[0,null,null,null,null,null,"","//","//"]
[0,null,null,null,null,null,"","//","//"]
[0,null,null,null,null,null,"","//","//"]
[0,null,null,null,null,null,"","//","//"]
[0,null,null,null,null,null,"","//","//"]
[0,null,null,null,null,null,"","//","//"]
[0,null,null,null,null,null,"","//","//"]
[0,null,null,null,null,null,"","//","//"]
[0,null,null,null,null,null,"","//","//"]
[0,null,null,null,null,null,"","//","//"]
[0,null,null,null,null,null,"","//","//"]
[0,null,null,null,null,null,"","//","//"]
[0,null,null,null,null,null,"","//","//"]
[0,null,null,null,null,null,"","//","//"]
[0,null,null,null,null,null,"","//","//"]
[0,null,null,null,null,null,"","//","//"]
[0,null,null,null,null,null,"","//","//"]
[0,null,null,null,null,null,"","//","//"]
[0,null,null,null,null,null,"","//","//"]
[0,null,null,null,null,null,"","//","//"]
[0,null,null,null,null,null,"","//","//"]
[0,null,null,null,null,null,"","//","//"]
[0,null,null,null,null,null,"","//","//"]
[0,null,null,null,null,null,"","//","//"]
[0,null,null,null,null,null,"","//","//"]
[0,null,null,null,null,null,"","//","//"]
[0,null,null,null,null,null,"","//","//"]
[0,null,null,null,null,null,"","//","//"]
[0,null,null,null,null,null,"","//","//"]
[0,null,null,null,null,null,"","//","//"]
[0,null,null,null,null,null,"","//","//"]
[0,null,null,null,null,null,"","//","//"]
[0,null,null,null,null,null,"","//","//"]
[0,null,null,null,null,null,"","//","//"]
[0,null,null,null,null,null,"","//","//"]
[0,null,null,null,null,null,"","//","//"]
[0,null,null,null,null,null,"","//","//"]
[0,null,null,null,null,null,"","//","//"]
[0,null,null,null,null,null,"","//","//"]
[0,null,null,null,null,null,"","//","//"]
[0,null,null,null,null,null,"","//","//"]
[0,null,null,null,null,null,"","//","//"]
[0,null,null,null,null,null,"",{"$f":"IF(OR($G7104=\"NTSI\",$G7104=\"TTSI\"),$E7104,LEFT($E7104,4)&\"/\"&MID($E7104,5,2)&\"/\"&RIGHT($E7104,2))","v":"//"},{"$f":"IF(OR($G7104=\"NTSI\",$G7104=\"TTSI\"),$F7104,LEFT($F7104,4)&\"/\"&MID($F7104,5,2)&\"/\"&RIGHT($F7104,2))","v":"//"}]
[0,null,null,null,null,null,"","//","//"]
[0,null,null,null,null,null,"","//","//"]
[0,null,null,null,null,null,"","//","//"]
[0,null,null,null,null,null,"","//","//"]
[{"$f":"IF(RIGHT(B7109,1)=\"H\",LEFT(B7109,11)&\"B\",B7109)","v":0},null,null,null,null,null,{"$f":"MID(C7109,4,4)","v":""},"//","//"]
[0,null,null,null,null,null,"","//","//"]
[0,null,null,null,null,null,"","//","//"]
[0,null,null,null,null,null,"","//","//"]
[0,null,null,null,null,null,"","//","//"]
[0,null,null,null,null,null,"","//","//"]
[0,null,null,null,null,null,"","//","//"]
[0,null,null,null,null,null,"","//","//"]
[0,null,null,null,null,null,"","//","//"]
[0,null,null,null,null,null,"","//","//"]
[0,null,null,null,null,null,"","//","//"]
[0,null,null,null,null,null,"","//","//"]
[0,null,null,null,null,null,"","//","//"]
[0,null,null,null,null,null,"","//","//"]
[0,null,null,null,null,null,"","//","//"]
[0,null,null,null,null,null,"","//","//"]
[0,null,null,null,null,null,"","//","//"]
[0,null,null,null,null,null,"","//","//"]
[0,null,null,null,null,null,"","//","//"]
[0,null,null,null,null,null,"","//","//"]
[0,null,null,null,null,null,"","//","//"]
[0,null,null,null,null,null,"","//","//"]
[0,null,null,null,null,null,"","//","//"]
[0,null,null,null,null,null,"","//","//"]
[0,null,null,null,null,null,"","//","//"]
[0,null,null,null,null,null,"","//","//"]
[0,null,null,null,null,null,"","//","//"]
[0,null,null,null,null,null,"","//","//"]
[0,null,null,null,null,null,"","//","//"]
[0,null,null,null,null,null,"","//","//"]
[0,null,null,null,null,null,"","//","//"]
[0,null,null,null,null,null,"","//","//"]
[0,null,null,null,null,null,"","//","//"]
[0,null,null,null,null,null,"","//","//"]
[0,null,null,null,null,null,"","//","//"]
[0,null,null,null,null,null,"","//","//"]
[0,null,null,null,null,null,"","//","//"]
[0,null,null,null,null,null,"","//","//"]
[0,null,null,null,null,null,"","//","//"]
[0,null,null,null,null,null,"","//","//"]
[0,null,null,null,null,null,"","//","//"]
[0,null,null,null,null,null,"","//","//"]
[0,null,null,null,null,null,"","//","//"]
[0,null,null,null,null,null,"","//","//"]
[0,null,null,null,null,null,"","//","//"]
[0,null,null,null,null,null,"","//","//"]
[0,null,null,null,null,null,"","//","//"]
[0,null,null,null,null,null,"","//","//"]
[0,null,null,null,null,null,"","//","//"]
[0,null,null,null,null,null,"","//","//"]
[0,null,null,null,null,null,"","//","//"]
[0,null,null,null,null,null,"","//","//"]
[0,null,null,null,null,null,"","//","//"]
[0,null,null,null,null,null,"","//","//"]
[0,null,null,null,null,null,"","//","//"]
[0,null,null,null,null,null,"","//","//"]
[0,null,null,null,null,null,"","//","//"]
[0,null,null,null,null,null,"","//","//"]
[0,null,null,null,null,null,"","//","//"]
[0,null,null,null,null,null,"",{"$f":"IF(OR($G7168=\"NTSI\",$G7168=\"TTSI\"),$E7168,LEFT($E7168,4)&\"/\"&MID($E7168,5,2)&\"/\"&RIGHT($E7168,2))","v":"//"},{"$f":"IF(OR($G7168=\"NTSI\",$G7168=\"TTSI\"),$F7168,LEFT($F7168,4)&\"/\"&MID($F7168,5,2)&\"/\"&RIGHT($F7168,2))","v":"//"}]
[0,null,null,null,null,null,"","//","//"]
[0,null,null,null,null,null,"","//","//"]
[0,null,null,null,null,null,"","//","//"]
[0,null,null,null,null,null,"","//","//"]
[{"$f":"IF(RIGHT(B7173,1)=\"H\",LEFT(B7173,11)&\"B\",B7173)","v":0},null,null,null,null,null,{"$f":"MID(C7173,4,4)","v":""},"//","//"]
[0,null,null,null,null,null,"","//","//"]
[0,null,null,null,null,null,"","//","//"]
[0,null,null,null,null,null,"","//","//"]
[0,null,null,null,null,null,"","//","//"]
[0,null,null,null,null,null,"","//","//"]
[0,null,null,null,null,null,"","//","//"]
[0,null,null,null,null,null,"","//","//"]
[0,null,null,null,null,null,"","//","//"]
[0,null,null,null,null,null,"","//","//"]
[0,null,null,null,null,null,"","//","//"]
[0,null,null,null,null,null,"","//","//"]
[0,null,null,null,null,null,"","//","//"]
[0,null,null,null,null,null,"","//","//"]
[0,null,null,null,null,null,"","//","//"]
[0,null,null,null,null,null,"","//","//"]
[0,null,null,null,null,null,"","//","//"]
[0,null,null,null,null,null,"","//","//"]
[0,null,null,null,null,null,"","//","//"]
[0,null,null,null,null,null,"","//","//"]
[0,null,null,null,null,null,"","//","//"]
[0,null,null,null,null,null,"","//","//"]
[0,null,null,null,null,null,"","//","//"]
[0,null,null,null,null,null,"","//","//"]
[0,null,null,null,null,null,"","//","//"]
[0,null,null,null,null,null,"","//","//"]
[0,null,null,null,null,null,"","//","//"]
[0,null,null,null,null,null,"","//","//"]
[0,null,null,null,null,null,"","//","//"]
[0,null,null,null,null,null,"","//","//"]
[0,null,null,null,null,null,"","//","//"]
[0,null,null,null,null,null,"","//","//"]
[0,null,null,null,null,null,"","//","//"]
[0,null,null,null,null,null,"","//","//"]
[0,null,null,null,null,null,"","//","//"]
[0,null,null,null,null,null,"","//","//"]
[0,null,null,null,null,null,"","//","//"]
[0,null,null,null,null,null,"","//","//"]
[0,null,null,null,null,null,"","//","//"]
[0,null,null,null,null,null,"","//","//"]
[0,null,null,null,null,null,"","//","//"]
[0,null,null,null,null,null,"","//","//"]
[0,null,null,null,null,null,"","//","//"]
[0,null,null,null,null,null,"","//","//"]
[0,null,null,null,null,null,"","//","//"]
[0,null,null,null,null,null,"","//","//"]
[0,null,null,null,null,null,"","//","//"]
[0,null,null,null,null,null,"","//","//"]
[0,null,null,null,null,null,"","//","//"]
[0,null,null,null,null,null,"","//","//"]
[0,null,null,null,null,null,"","//","//"]
[0,null,null,null,null,null,"","//","//"]
[0,null,null,null,null,null,"","//","//"]
[0,null,null,null,null,null,"","//","//"]
[0,null,null,null,null,null,"","//","//"]
[0,null,null,null,null,null,"","//","//"]
[0,null,null,null,null,null,"","//","//"]
[0,null,null,null,null,null,"","//","//"]
[0,null,null,null,null,null,"","//","//"]
[0,null,null,null,null,null,"",{"$f":"IF(OR($G7232=\"NTSI\",$G7232=\"TTSI\"),$E7232,LEFT($E7232,4)&\"/\"&MID($E7232,5,2)&\"/\"&RIGHT($E7232,2))","v":"//"},{"$f":"IF(OR($G7232=\"NTSI\",$G7232=\"TTSI\"),$F7232,LEFT($F7232,4)&\"/\"&MID($F7232,5,2)&\"/\"&RIGHT($F7232,2))","v":"//"}]
[0,null,null,null,null,null,"","//","//"]
[0,null,null,null,null,null,"","//","//"]
[0,null,null,null,null,null,"","//","//"]
[0,null,null,null,null,null,"","//","//"]
[{"$f":"IF(RIGHT(B7237,1)=\"H\",LEFT(B7237,11)&\"B\",B7237)","v":0},null,null,null,null,null,{"$f":"MID(C7237,4,4)","v":""},"//","//"]
[0,null,null,null,null,null,"","//","//"]
[0,null,null,null,null,null,"","//","//"]
[0,null,null,null,null,null,"","//","//"]
[0,null,null,null,null,null,"","//","//"]
[0,null,null,null,null,null,"","//","//"]
[0,null,null,null,null,null,"","//","//"]
[0,null,null,null,null,null,"","//","//"]
[0,null,null,null,null,null,"","//","//"]
[0,null,null,null,null,null,"","//","//"]
[0,null,null,null,null,null,"","//","//"]
[0,null,null,null,null,null,"","//","//"]
[0,null,null,null,null,null,"","//","//"]
[0,null,null,null,null,null,"","//","//"]
[0,null,null,null,null,null,"","//","//"]
[0,null,null,null,null,null,"","//","//"]
[0,null,null,null,null,null,"","//","//"]
[0,null,null,null,null,null,"","//","//"]
[0,null,null,null,null,null,"","//","//"]
[0,null,null,null,null,null,"","//","//"]
[0,null,null,null,null,null,"","//","//"]
[0,null,null,null,null,null,"","//","//"]
[0,null,null,null,null,null,"","//","//"]
[0,null,null,null,null,null,"","//","//"]
[0,null,null,null,null,null,"","//","//"]
[0,null,null,null,null,null,"","//","//"]
[0,null,null,null,null,null,"","//","//"]
[0,null,null,null,null,null,"","//","//"]
[0,null,null,null,null,null,"","//","//"]
[0,null,null,null,null,null,"","//","//"]
[0,null,null,null,null,null,"","//","//"]
[0,null,null,null,null,null,"","//","//"]
[0,null,null,null,null,null,"","//","//"]
[0,null,null,null,null,null,"","//","//"]
[0,null,null,null,null,null,"","//","//"]
[0,null,null,null,null,null,"","//","//"]
[0,null,null,null,null,null,"","//","//"]
[0,null,null,null,null,null,"","//","//"]
[0,null,null,null,null,null,"","//","//"]
[0,null,null,null,null,null,"","//","//"]
[0,null,null,null,null,null,"","//","//"]
[0,null,null,null,null,null,"","//","//"]
[0,null,null,null,null,null,"","//","//"]
[0,null,null,null,null,null,"","//","//"]
[0,null,null,null,null,null,"","//","//"]
[0,null,null,null,null,null,"","//","//"]
[0,null,null,null,null,null,"","//","//"]
[0,null,null,null,null,null,"","//","//"]
[0,null,null,null,null,null,"","//","//"]
[0,null,null,null,null,null,"","//","//"]
[0,null,null,null,null,null,"","//","//"]
[0,null,null,null,null,null,"","//","//"]
[0,null,null,null,null,null,"","//","//"]
[0,null,null,null,null,null,"","//","//"]
[0,null,null,null,null,null,"","//","//"]
[0,null,null,null,null,null,"","//","//"]
[0,null,null,null,null,null,"","//","//"]
[0,null,null,null,null,null,"","//","//"]
[0,null,null,null,null,null,"","//","//"]
[0,null,null,null,null,null,"",{"$f":"IF(OR($G7296=\"NTSI\",$G7296=\"TTSI\"),$E7296,LEFT($E7296,4)&\"/\"&MID($E7296,5,2)&\"/\"&RIGHT($E7296,2))","v":"//"},{"$f":"IF(OR($G7296=\"NTSI\",$G7296=\"TTSI\"),$F7296,LEFT($F7296,4)&\"/\"&MID($F7296,5,2)&\"/\"&RIGHT($F7296,2))","v":"//"}]
[0,null,null,null,null,null,"","//","//"]
[0,null,null,null,null,null,"","//","//"]
[0,null,null,null,null,null,"","//","//"]
[0,null,null,null,null,null,"","//","//"]
[{"$f":"IF(RIGHT(B7301,1)=\"H\",LEFT(B7301,11)&\"B\",B7301)","v":0},null,null,null,null,null,{"$f":"MID(C7301,4,4)","v":""},"//","//"]
[0,null,null,null,null,null,"","//","//"]
[0,null,null,null,null,null,"","//","//"]
[0,null,null,null,null,null,"","//","//"]
[0,null,null,null,null,null,"","//","//"]
[0,null,null,null,null,null,"","//","//"]
[0,null,null,null,null,null,"","//","//"]
[0,null,null,null,null,null,"","//","//"]
[0,null,null,null,null,null,"","//","//"]
[0,null,null,null,null,null,"","//","//"]
[0,null,null,null,null,null,"","//","//"]
[0,null,null,null,null,null,"","//","//"]
[0,null,null,null,null,null,"","//","//"]
[0,null,null,null,null,null,"","//","//"]
[0,null,null,null,null,null,"","//","//"]
[0,null,null,null,null,null,"","//","//"]
[0,null,null,null,null,null,"","//","//"]
[0,null,null,null,null,null,"","//","//"]
[0,null,null,null,null,null,"","//","//"]
[0,null,null,null,null,null,"","//","//"]
[0,null,null,null,null,null,"","//","//"]
[0,null,null,null,null,null,"","//","//"]
[0,null,null,null,null,null,"","//","//"]
[0,null,null,null,null,null,"","//","//"]
[0,null,null,null,null,null,"","//","//"]
[0,null,null,null,null,null,"","//","//"]
[0,null,null,null,null,null,"","//","//"]
[0,null,null,null,null,null,"","//","//"]
[0,null,null,null,null,null,"","//","//"]
[0,null,null,null,null,null,"","//","//"]
[0,null,null,null,null,null,"","//","//"]
[0,null,null,null,null,null,"","//","//"]
[0,null,null,null,null,null,"","//","//"]
[0,null,null,null,null,null,"","//","//"]
[0,null,null,null,null,null,"","//","//"]
[0,null,null,null,null,null,"","//","//"]
[0,null,null,null,null,null,"","//","//"]
[0,null,null,null,null,null,"","//","//"]
[0,null,null,null,null,null,"","//","//"]
[0,null,null,null,null,null,"","//","//"]
[0,null,null,null,null,null,"","//","//"]
[0,null,null,null,null,null,"","//","//"]
[0,null,null,null,null,null,"","//","//"]
[0,null,null,null,null,null,"","//","//"]
[0,null,null,null,null,null,"","//","//"]
[0,null,null,null,null,null,"","//","//"]
[0,null,null,null,null,null,"","//","//"]
[0,null,null,null,null,null,"","//","//"]
[0,null,null,null,null,null,"","//","//"]
[0,null,null,null,null,null,"","//","//"]
[0,null,null,null,null,null,"","//","//"]
[0,null,null,null,null,null,"","//","//"]
[0,null,null,null,null,null,"","//","//"]
[0,null,null,null,null,null,"","//","//"]
[0,null,null,null,null,null,"","//","//"]
[0,null,null,null,null,null,"","//","//"]
[0,null,null,null,null,null,"","//","//"]
[0,null,null,null,null,null,"","//","//"]
[0,null,null,null,null,null,"","//","//"]
[0,null,null,null,null,null,"",{"$f":"IF(OR($G7360=\"NTSI\",$G7360=\"TTSI\"),$E7360,LEFT($E7360,4)&\"/\"&MID($E7360,5,2)&\"/\"&RIGHT($E7360,2))","v":"//"},{"$f":"IF(OR($G7360=\"NTSI\",$G7360=\"TTSI\"),$F7360,LEFT($F7360,4)&\"/\"&MID($F7360,5,2)&\"/\"&RIGHT($F7360,2))","v":"//"}]
[0,null,null,null,null,null,"","//","//"]
[0,null,null,null,null,null,"","//","//"]
[0,null,null,null,null,null,"","//","//"]
[0,null,null,null,null,null,"","//","//"]
[{"$f":"IF(RIGHT(B7365,1)=\"H\",LEFT(B7365,11)&\"B\",B7365)","v":0},null,null,null,null,null,{"$f":"MID(C7365,4,4)","v":""},"//","//"]
[0,null,null,null,null,null,"","//","//"]
[0,null,null,null,null,null,"","//","//"]
[0,null,null,null,null,null,"","//","//"]
[0,null,null,null,null,null,"","//","//"]
[0,null,null,null,null,null,"","//","//"]
[0,null,null,null,null,null,"","//","//"]
[0,null,null,null,null,null,"","//","//"]
[0,null,null,null,null,null,"","//","//"]
[0,null,null,null,null,null,"","//","//"]
[0,null,null,null,null,null,"","//","//"]
[0,null,null,null,null,null,"","//","//"]
[0,null,null,null,null,null,"","//","//"]
[0,null,null,null,null,null,"","//","//"]
[0,null,null,null,null,null,"","//","//"]
[0,null,null,null,null,null,"","//","//"]
[0,null,null,null,null,null,"","//","//"]
[0,null,null,null,null,null,"","//","//"]
[0,null,null,null,null,null,"","//","//"]
[0,null,null,null,null,null,"","//","//"]
[0,null,null,null,null,null,"","//","//"]
[0,null,null,null,null,null,"","//","//"]
[0,null,null,null,null,null,"","//","//"]
[0,null,null,null,null,null,"","//","//"]
[0,null,null,null,null,null,"","//","//"]
[0,null,null,null,null,null,"","//","//"]
[0,null,null,null,null,null,"","//","//"]
[0,null,null,null,null,null,"","//","//"]
[0,null,null,null,null,null,"","//","//"]
[0,null,null,null,null,null,"","//","//"]
[0,null,null,null,null,null,"","//","//"]
[0,null,null,null,null,null,"","//","//"]
[0,null,null,null,null,null,"","//","//"]
[0,null,null,null,null,null,"","//","//"]
[0,null,null,null,null,null,"","//","//"]
[0,null,null,null,null,null,"","//","//"]
[0,null,null,null,null,null,"","//","//"]
[0,null,null,null,null,null,"","//","//"]
[0,null,null,null,null,null,"","//","//"]
[0,null,null,null,null,null,"","//","//"]
[0,null,null,null,null,null,"","//","//"]
[0,null,null,null,null,null,"","//","//"]
[0,null,null,null,null,null,"","//","//"]
[0,null,null,null,null,null,"","//","//"]
[0,null,null,null,null,null,"","//","//"]
[0,null,null,null,null,null,"","//","//"]
[0,null,null,null,null,null,"","//","//"]
[0,null,null,null,null,null,"","//","//"]
[0,null,null,null,null,null,"","//","//"]
[0,null,null,null,null,null,"","//","//"]
[0,null,null,null,null,null,"","//","//"]
[0,null,null,null,null,null,"","//","//"]
[0,null,null,null,null,null,"","//","//"]
[0,null,null,null,null,null,"","//","//"]
[0,null,null,null,null,null,"","//","//"]
[0,null,null,null,null,null,"","//","//"]
[0,null,null,null,null,null,"","//","//"]
[0,null,null,null,null,null,"","//","//"]
[0,null,null,null,null,null,"","//","//"]
[0,null,null,null,null,null,"",{"$f":"IF(OR($G7424=\"NTSI\",$G7424=\"TTSI\"),$E7424,LEFT($E7424,4)&\"/\"&MID($E7424,5,2)&\"/\"&RIGHT($E7424,2))","v":"//"},{"$f":"IF(OR($G7424=\"NTSI\",$G7424=\"TTSI\"),$F7424,LEFT($F7424,4)&\"/\"&MID($F7424,5,2)&\"/\"&RIGHT($F7424,2))","v":"//"}]
[0,null,null,null,null,null,"","//","//"]
[0,null,null,null,null,null,"","//","//"]
[0,null,null,null,null,null,"","//","//"]
[0,null,null,null,null,null,"","//","//"]
[{"$f":"IF(RIGHT(B7429,1)=\"H\",LEFT(B7429,11)&\"B\",B7429)","v":0},null,null,null,null,null,{"$f":"MID(C7429,4,4)","v":""},"//","//"]
[0,null,null,null,null,null,"","//","//"]
[0,null,null,null,null,null,"","//","//"]
[0,null,null,null,null,null,"","//","//"]
[0,null,null,null,null,null,"","//","//"]
[0,null,null,null,null,null,"","//","//"]
[0,null,null,null,null,null,"","//","//"]
[0,null,null,null,null,null,"","//","//"]
[0,null,null,null,null,null,"","//","//"]
[0,null,null,null,null,null,"","//","//"]
[0,null,null,null,null,null,"","//","//"]
[0,null,null,null,null,null,"","//","//"]
[0,null,null,null,null,null,"","//","//"]
[0,null,null,null,null,null,"","//","//"]
[0,null,null,null,null,null,"","//","//"]
[0,null,null,null,null,null,"","//","//"]
[0,null,null,null,null,null,"","//","//"]
[0,null,null,null,null,null,"","//","//"]
[0,null,null,null,null,null,"","//","//"]
[0,null,null,null,null,null,"","//","//"]
[0,null,null,null,null,null,"","//","//"]
[0,null,null,null,null,null,"","//","//"]
[0,null,null,null,null,null,"","//","//"]
[0,null,null,null,null,null,"","//","//"]
[0,null,null,null,null,null,"","//","//"]
[0,null,null,null,null,null,"","//","//"]
[0,null,null,null,null,null,"","//","//"]
[0,null,null,null,null,null,"","//","//"]
[0,null,null,null,null,null,"","//","//"]
[0,null,null,null,null,null,"","//","//"]
[0,null,null,null,null,null,"","//","//"]
[0,null,null,null,null,null,"","//","//"]
[0,null,null,null,null,null,"","//","//"]
[0,null,null,null,null,null,"","//","//"]
[0,null,null,null,null,null,"","//","//"]
[0,null,null,null,null,null,"","//","//"]
[0,null,null,null,null,null,"","//","//"]
[0,null,null,null,null,null,"","//","//"]
[0,null,null,null,null,null,"","//","//"]
[0,null,null,null,null,null,"","//","//"]
[0,null,null,null,null,null,"","//","//"]
[0,null,null,null,null,null,"","//","//"]
[0,null,null,null,null,null,"","//","//"]
[0,null,null,null,null,null,"","//","//"]
[0,null,null,null,null,null,"","//","//"]
[0,null,null,null,null,null,"","//","//"]
[0,null,null,null,null,null,"","//","//"]
[0,null,null,null,null,null,"","//","//"]
[0,null,null,null,null,null,"","//","//"]
[0,null,null,null,null,null,"","//","//"]
[0,null,null,null,null,null,"","//","//"]
[0,null,null,null,null,null,"","//","//"]
[0,null,null,null,null,null,"","//","//"]
[0,null,null,null,null,null,"","//","//"]
[0,null,null,null,null,null,"","//","//"]
[0,null,null,null,null,null,"","//","//"]
[0,null,null,null,null,null,"","//","//"]
[0,null,null,null,null,null,"","//","//"]
[0,null,null,null,null,null,"","//","//"]
[0,null,null,null,null,null,"",{"$f":"IF(OR($G7488=\"NTSI\",$G7488=\"TTSI\"),$E7488,LEFT($E7488,4)&\"/\"&MID($E7488,5,2)&\"/\"&RIGHT($E7488,2))","v":"//"},{"$f":"IF(OR($G7488=\"NTSI\",$G7488=\"TTSI\"),$F7488,LEFT($F7488,4)&\"/\"&MID($F7488,5,2)&\"/\"&RIGHT($F7488,2))","v":"//"}]
[0,null,null,null,null,null,"","//","//"]
[0,null,null,null,null,null,"","//","//"]
[0,null,null,null,null,null,"","//","//"]
[0,null,null,null,null,null,"","//","//"]
[{"$f":"IF(RIGHT(B7493,1)=\"H\",LEFT(B7493,11)&\"B\",B7493)","v":0},null,null,null,null,null,{"$f":"MID(C7493,4,4)","v":""},"//","//"]
[0,null,null,null,null,null,"","//","//"]
[0,null,null,null,null,null,"","//","//"]
[0,null,null,null,null,null,"","//","//"]
[0,null,null,null,null,null,"","//","//"]
[0,null,null,null,null,null,"","//","//"]
[0,null,null,null,null,null,"","//","//"]
[0,null,null,null,null,null,"","//","//"]
[0,null,null,null,null,null,"","//","//"]
[0,null,null,null,null,null,"","//","//"]
[0,null,null,null,null,null,"","//","//"]
[0,null,null,null,null,null,"","//","//"]
[0,null,null,null,null,null,"","//","//"]
[0,null,null,null,null,null,"","//","//"]
[0,null,null,null,null,null,"","//","//"]
[0,null,null,null,null,null,"","//","//"]
[0,null,null,null,null,null,"","//","//"]
[0,null,null,null,null,null,"","//","//"]
[0,null,null,null,null,null,"","//","//"]
[0,null,null,null,null,null,"","//","//"]
[0,null,null,null,null,null,"","//","//"]
[0,null,null,null,null,null,"","//","//"]
[0,null,null,null,null,null,"","//","//"]
[0,null,null,null,null,null,"","//","//"]
[0,null,null,null,null,null,"","//","//"]
[0,null,null,null,null,null,"","//","//"]
[0,null,null,null,null,null,"","//","//"]
[0,null,null,null,null,null,"","//","//"]
[0,null,null,null,null,null,"","//","//"]
[0,null,null,null,null,null,"","//","//"]
[0,null,null,null,null,null,"","//","//"]
[0,null,null,null,null,null,"","//","//"]
[0,null,null,null,null,null,"","//","//"]
[0,null,null,null,null,null,"","//","//"]
[0,null,null,null,null,null,"","//","//"]
[0,null,null,null,null,null,"","//","//"]
[0,null,null,null,null,null,"","//","//"]
[0,null,null,null,null,null,"","//","//"]
[0,null,null,null,null,null,"","//","//"]
[0,null,null,null,null,null,"","//","//"]
[0,null,null,null,null,null,"","//","//"]
[0,null,null,null,null,null,"","//","//"]
[0,null,null,null,null,null,"","//","//"]
[0,null,null,null,null,null,"","//","//"]
[0,null,null,null,null,null,"","//","//"]
[0,null,null,null,null,null,"","//","//"]
[0,null,null,null,null,null,"","//","//"]
[0,null,null,null,null,null,"","//","//"]
[0,null,null,null,null,null,"","//","//"]
[0,null,null,null,null,null,"","//","//"]
[0,null,null,null,null,null,"","//","//"]
[0,null,null,null,null,null,"","//","//"]
[0,null,null,null,null,null,"","//","//"]
[0,null,null,null,null,null,"","//","//"]
[0,null,null,null,null,null,"","//","//"]
[0,null,null,null,null,null,"","//","//"]
[0,null,null,null,null,null,"","//","//"]
[0,null,null,null,null,null,"","//","//"]
[0,null,null,null,null,null,"","//","//"]
[0,null,null,null,null,null,"",{"$f":"IF(OR($G7552=\"NTSI\",$G7552=\"TTSI\"),$E7552,LEFT($E7552,4)&\"/\"&MID($E7552,5,2)&\"/\"&RIGHT($E7552,2))","v":"//"},{"$f":"IF(OR($G7552=\"NTSI\",$G7552=\"TTSI\"),$F7552,LEFT($F7552,4)&\"/\"&MID($F7552,5,2)&\"/\"&RIGHT($F7552,2))","v":"//"}]
[0,null,null,null,null,null,"","//","//"]
[0,null,null,null,null,null,"","//","//"]
[0,null,null,null,null,null,"","//","//"]
[0,null,null,null,null,null,"","//","//"]
[{"$f":"IF(RIGHT(B7557,1)=\"H\",LEFT(B7557,11)&\"B\",B7557)","v":0},null,null,null,null,null,{"$f":"MID(C7557,4,4)","v":""},"//","//"]
[0,null,null,null,null,null,"","//","//"]
[0,null,null,null,null,null,"","//","//"]
[0,null,null,null,null,null,"","//","//"]
[0,null,null,null,null,null,"","//","//"]
[0,null,null,null,null,null,"","//","//"]
[0,null,null,null,null,null,"","//","//"]
[0,null,null,null,null,null,"","//","//"]
[0,null,null,null,null,null,"","//","//"]
[0,null,null,null,null,null,"","//","//"]
[0,null,null,null,null,null,"","//","//"]
[0,null,null,null,null,null,"","//","//"]
[0,null,null,null,null,null,"","//","//"]
[0,null,null,null,null,null,"","//","//"]
[0,null,null,null,null,null,"","//","//"]
[0,null,null,null,null,null,"","//","//"]
[0,null,null,null,null,null,"","//","//"]
[0,null,null,null,null,null,"","//","//"]
[0,null,null,null,null,null,"","//","//"]
[0,null,null,null,null,null,"","//","//"]
[0,null,null,null,null,null,"","//","//"]
[0,null,null,null,null,null,"","//","//"]
[0,null,null,null,null,null,"","//","//"]
[0,null,null,null,null,null,"","//","//"]
[0,null,null,null,null,null,"","//","//"]
[0,null,null,null,null,null,"","//","//"]
[0,null,null,null,null,null,"","//","//"]
[0,null,null,null,null,null,"","//","//"]
[0,null,null,null,null,null,"","//","//"]
[0,null,null,null,null,null,"","//","//"]
[0,null,null,null,null,null,"","//","//"]
[0,null,null,null,null,null,"","//","//"]
[0,null,null,null,null,null,"","//","//"]
[0,null,null,null,null,null,"","//","//"]
[0,null,null,null,null,null,"","//","//"]
[0,null,null,null,null,null,"","//","//"]
[0,null,null,null,null,null,"","//","//"]
[0,null,null,null,null,null,"","//","//"]
[0,null,null,null,null,null,"","//","//"]
[0,null,null,null,null,null,"","//","//"]
[0,null,null,null,null,null,"","//","//"]
[0,null,null,null,null,null,"","//","//"]
[0,null,null,null,null,null,"","//","//"]
[0,null,null,null,null,null,"","//","//"]
[0,null,null,null,null,null,"","//","//"]
[0,null,null,null,null,null,"","//","//"]
[0,null,null,null,null,null,"","//","//"]
[0,null,null,null,null,null,"","//","//"]
[0,null,null,null,null,null,"","//","//"]
[0,null,null,null,null,null,"","//","//"]
[0,null,null,null,null,null,"","//","//"]
[0,null,null,null,null,null,"","//","//"]
[0,null,null,null,null,null,"","//","//"]
[0,null,null,null,null,null,"","//","//"]
[0,null,null,null,null,null,"","//","//"]
[0,null,null,null,null,null,"","//","//"]
[0,null,null,null,null,null,"","//","//"]
[0,null,null,null,null,null,"","//","//"]
[0,null,null,null,null,null,"","//","//"]
[0,null,null,null,null,null,"",{"$f":"IF(OR($G7616=\"NTSI\",$G7616=\"TTSI\"),$E7616,LEFT($E7616,4)&\"/\"&MID($E7616,5,2)&\"/\"&RIGHT($E7616,2))","v":"//"},{"$f":"IF(OR($G7616=\"NTSI\",$G7616=\"TTSI\"),$F7616,LEFT($F7616,4)&\"/\"&MID($F7616,5,2)&\"/\"&RIGHT($F7616,2))","v":"//"}]
[0,null,null,null,null,null,"","//","//"]
[0,null,null,null,null,null,"","//","//"]
[0,null,null,null,null,null,"","//","//"]
[0,null,null,null,null,null,"","//","//"]
[{"$f":"IF(RIGHT(B7621,1)=\"H\",LEFT(B7621,11)&\"B\",B7621)","v":0},null,null,null,null,null,{"$f":"MID(C7621,4,4)","v":""},"//","//"]
[0,null,null,null,null,null,"","//","//"]
[0,null,null,null,null,null,"","//","//"]
[0,null,null,null,null,null,"","//","//"]
[0,null,null,null,null,null,"","//","//"]
[0,null,null,null,null,null,"","//","//"]
[0,null,null,null,null,null,"","//","//"]
[0,null,null,null,null,null,"","//","//"]
[0,null,null,null,null,null,"","//","//"]
[0,null,null,null,null,null,"","//","//"]
[0,null,null,null,null,null,"","//","//"]
[0,null,null,null,null,null,"","//","//"]
[0,null,null,null,null,null,"","//","//"]
[0,null,null,null,null,null,"","//","//"]
[0,null,null,null,null,null,"","//","//"]
[0,null,null,null,null,null,"","//","//"]
[0,null,null,null,null,null,"","//","//"]
[0,null,null,null,null,null,"","//","//"]
[0,null,null,null,null,null,"","//","//"]
[0,null,null,null,null,null,"","//","//"]
[0,null,null,null,null,null,"","//","//"]
[0,null,null,null,null,null,"","//","//"]
[0,null,null,null,null,null,"","//","//"]
[0,null,null,null,null,null,"","//","//"]
[0,null,null,null,null,null,"","//","//"]
[0,null,null,null,null,null,"","//","//"]
[0,null,null,null,null,null,"","//","//"]
[0,null,null,null,null,null,"","//","//"]
[0,null,null,null,null,null,"","//","//"]
[0,null,null,null,null,null,"","//","//"]
[0,null,null,null,null,null,"","//","//"]
[0,null,null,null,null,null,"","//","//"]
[0,null,null,null,null,null,"","//","//"]
[0,null,null,null,null,null,"","//","//"]
[0,null,null,null,null,null,"","//","//"]
[0,null,null,null,null,null,"","//","//"]
[0,null,null,null,null,null,"","//","//"]
[0,null,null,null,null,null,"","//","//"]
[0,null,null,null,null,null,"","//","//"]
[0,null,null,null,null,null,"","//","//"]
[0,null,null,null,null,null,"","//","//"]
[0,null,null,null,null,null,"","//","//"]
[0,null,null,null,null,null,"","//","//"]
[0,null,null,null,null,null,"","//","//"]
[0,null,null,null,null,null,"","//","//"]
[0,null,null,null,null,null,"","//","//"]
[0,null,null,null,null,null,"","//","//"]
[0,null,null,null,null,null,"","//","//"]
[0,null,null,null,null,null,"","//","//"]
[0,null,null,null,null,null,"","//","//"]
[0,null,null,null,null,null,"","//","//"]
[0,null,null,null,null,null,"","//","//"]
[0,null,null,null,null,null,"","//","//"]
[0,null,null,null,null,null,"","//","//"]
[0,null,null,null,null,null,"","//","//"]
[0,null,null,null,null,null,"","//","//"]
[0,null,null,null,null,null,"","//","//"]
[0,null,null,null,null,null,"","//","//"]
[0,null,null,null,null,null,"","//","//"]
[0,null,null,null,null,null,"",{"$f":"IF(OR($G7680=\"NTSI\",$G7680=\"TTSI\"),$E7680,LEFT($E7680,4)&\"/\"&MID($E7680,5,2)&\"/\"&RIGHT($E7680,2))","v":"//"},{"$f":"IF(OR($G7680=\"NTSI\",$G7680=\"TTSI\"),$F7680,LEFT($F7680,4)&\"/\"&MID($F7680,5,2)&\"/\"&RIGHT($F7680,2))","v":"//"}]
[0,null,null,null,null,null,"","//","//"]
[0,null,null,null,null,null,"","//","//"]
[0,null,null,null,null,null,"","//","//"]
[0,null,null,null,null,null,"","//","//"]
[{"$f":"IF(RIGHT(B7685,1)=\"H\",LEFT(B7685,11)&\"B\",B7685)","v":0},null,null,null,null,null,{"$f":"MID(C7685,4,4)","v":""},"//","//"]
[0,null,null,null,null,null,"","//","//"]
[0,null,null,null,null,null,"","//","//"]
[0,null,null,null,null,null,"","//","//"]
[0,null,null,null,null,null,"","//","//"]
[0,null,null,null,null,null,"","//","//"]
[0,null,null,null,null,null,"","//","//"]
[0,null,null,null,null,null,"","//","//"]
[0,null,null,null,null,null,"","//","//"]
[0,null,null,null,null,null,"","//","//"]
[0,null,null,null,null,null,"","//","//"]
[0,null,null,null,null,null,"","//","//"]
[0,null,null,null,null,null,"","//","//"]
[0,null,null,null,null,null,"","//","//"]
[0,null,null,null,null,null,"","//","//"]
[0,null,null,null,null,null,"","//","//"]
[0,null,null,null,null,null,"","//","//"]
[0,null,null,null,null,null,"","//","//"]
[0,null,null,null,null,null,"","//","//"]
[0,null,null,null,null,null,"","//","//"]
[0,null,null,null,null,null,"","//","//"]
[0,null,null,null,null,null,"","//","//"]
[0,null,null,null,null,null,"","//","//"]
[0,null,null,null,null,null,"","//","//"]
[0,null,null,null,null,null,"","//","//"]
[0,null,null,null,null,null,"","//","//"]
[0,null,null,null,null,null,"","//","//"]
[0,null,null,null,null,null,"","//","//"]
[0,null,null,null,null,null,"","//","//"]
[0,null,null,null,null,null,"","//","//"]
[0,null,null,null,null,null,"","//","//"]
[0,null,null,null,null,null,"","//","//"]
[0,null,null,null,null,null,"","//","//"]
[0,null,null,null,null,null,"","//","//"]
[0,null,null,null,null,null,"","//","//"]
[0,null,null,null,null,null,"","//","//"]
[0,null,null,null,null,null,"","//","//"]
[0,null,null,null,null,null,"","//","//"]
[0,null,null,null,null,null,"","//","//"]
[0,null,null,null,null,null,"","//","//"]
[0,null,null,null,null,null,"","//","//"]
[0,null,null,null,null,null,"","//","//"]
[0,null,null,null,null,null,"","//","//"]
[0,null,null,null,null,null,"","//","//"]
[0,null,null,null,null,null,"","//","//"]
[0,null,null,null,null,null,"","//","//"]
[0,null,null,null,null,null,"","//","//"]
[0,null,null,null,null,null,"","//","//"]
[0,null,null,null,null,null,"","//","//"]
[0,null,null,null,null,null,"","//","//"]
[0,null,null,null,null,null,"","//","//"]
[0,null,null,null,null,null,"","//","//"]
[0,null,null,null,null,null,"","//","//"]
[0,null,null,null,null,null,"","//","//"]
[0,null,null,null,null,null,"","//","//"]
[0,null,null,null,null,null,"","//","//"]
[0,null,null,null,null,null,"","//","//"]
[0,null,null,null,null,null,"","//","//"]
[0,null,null,null,null,null,"","//","//"]
[0,null,null,null,null,null,"",{"$f":"IF(OR($G7744=\"NTSI\",$G7744=\"TTSI\"),$E7744,LEFT($E7744,4)&\"/\"&MID($E7744,5,2)&\"/\"&RIGHT($E7744,2))","v":"//"},{"$f":"IF(OR($G7744=\"NTSI\",$G7744=\"TTSI\"),$F7744,LEFT($F7744,4)&\"/\"&MID($F7744,5,2)&\"/\"&RIGHT($F7744,2))","v":"//"}]
[0,null,null,null,null,null,"","//","//"]
[0,null,null,null,null,null,"","//","//"]
[0,null,null,null,null,null,"","//","//"]
[0,null,null,null,null,null,"","//","//"]
[{"$f":"IF(RIGHT(B7749,1)=\"H\",LEFT(B7749,11)&\"B\",B7749)","v":0},null,null,null,null,null,{"$f":"MID(C7749,4,4)","v":""},"//","//"]
[0,null,null,null,null,null,"","//","//"]
[0,null,null,null,null,null,"","//","//"]
[0,null,null,null,null,null,"","//","//"]
[0,null,null,null,null,null,"","//","//"]
[0,null,null,null,null,null,"","//","//"]
[0,null,null,null,null,null,"","//","//"]
[0,null,null,null,null,null,"","//","//"]
[0,null,null,null,null,null,"","//","//"]
[0,null,null,null,null,null,"","//","//"]
[0,null,null,null,null,null,"","//","//"]
[0,null,null,null,null,null,"","//","//"]
[0,null,null,null,null,null,"","//","//"]
[0,null,null,null,null,null,"","//","//"]
[0,null,null,null,null,null,"","//","//"]
[0,null,null,null,null,null,"","//","//"]
[0,null,null,null,null,null,"","//","//"]
[0,null,null,null,null,null,"","//","//"]
[0,null,null,null,null,null,"","//","//"]
[0,null,null,null,null,null,"","//","//"]
[0,null,null,null,null,null,"","//","//"]
[0,null,null,null,null,null,"","//","//"]
[0,null,null,null,null,null,"","//","//"]
[0,null,null,null,null,null,"","//","//"]
[0,null,null,null,null,null,"","//","//"]
[0,null,null,null,null,null,"","//","//"]
[0,null,null,null,null,null,"","//","//"]
[0,null,null,null,null,null,"","//","//"]
[0,null,null,null,null,null,"","//","//"]
[0,null,null,null,null,null,"","//","//"]
[0,null,null,null,null,null,"","//","//"]
[0,null,null,null,null,null,"","//","//"]
[0,null,null,null,null,null,"","//","//"]
[0,null,null,null,null,null,"","//","//"]
[0,null,null,null,null,null,"","//","//"]
[0,null,null,null,null,null,"","//","//"]
[0,null,null,null,null,null,"","//","//"]
[0,null,null,null,null,null,"","//","//"]
[0,null,null,null,null,null,"","//","//"]
[0,null,null,null,null,null,"","//","//"]
[0,null,null,null,null,null,"","//","//"]
[0,null,null,null,null,null,"","//","//"]
[0,null,null,null,null,null,"","//","//"]
[0,null,null,null,null,null,"","//","//"]
[0,null,null,null,null,null,"","//","//"]
[0,null,null,null,null,null,"","//","//"]
[0,null,null,null,null,null,"","//","//"]
[0,null,null,null,null,null,"","//","//"]
[0,null,null,null,null,null,"","//","//"]
[0,null,null,null,null,null,"","//","//"]
[0,null,null,null,null,null,"","//","//"]
[0,null,null,null,null,null,"","//","//"]
[0,null,null,null,null,null,"","//","//"]
[0,null,null,null,null,null,"","//","//"]
[0,null,null,null,null,null,"","//","//"]
[0,null,null,null,null,null,"","//","//"]
[0,null,null,null,null,null,"","//","//"]
[0,null,null,null,null,null,"","//","//"]
[0,null,null,null,null,null,"","//","//"]
[0,null,null,null,null,null,"",{"$f":"IF(OR($G7808=\"NTSI\",$G7808=\"TTSI\"),$E7808,LEFT($E7808,4)&\"/\"&MID($E7808,5,2)&\"/\"&RIGHT($E7808,2))","v":"//"},{"$f":"IF(OR($G7808=\"NTSI\",$G7808=\"TTSI\"),$F7808,LEFT($F7808,4)&\"/\"&MID($F7808,5,2)&\"/\"&RIGHT($F7808,2))","v":"//"}]
[0,null,null,null,null,null,"","//","//"]
[0,null,null,null,null,null,"","//","//"]
[0,null,null,null,null,null,"","//","//"]
[0,null,null,null,null,null,"","//","//"]
[{"$f":"IF(RIGHT(B7813,1)=\"H\",LEFT(B7813,11)&\"B\",B7813)","v":0},null,null,null,null,null,{"$f":"MID(C7813,4,4)","v":""},"//","//"]
[0,null,null,null,null,null,"","//","//"]
[0,null,null,null,null,null,"","//","//"]
[0,null,null,null,null,null,"","//","//"]
[0,null,null,null,null,null,"","//","//"]
[0,null,null,null,null,null,"","//","//"]
[0,null,null,null,null,null,"","//","//"]
[0,null,null,null,null,null,"","//","//"]
[0,null,null,null,null,null,"","//","//"]
[0,null,null,null,null,null,"","//","//"]
[0,null,null,null,null,null,"","//","//"]
[0,null,null,null,null,null,"","//","//"]
[0,null,null,null,null,null,"","//","//"]
[0,null,null,null,null,null,"","//","//"]
[0,null,null,null,null,null,"","//","//"]
[0,null,null,null,null,null,"","//","//"]
[0,null,null,null,null,null,"","//","//"]
[0,null,null,null,null,null,"","//","//"]
[0,null,null,null,null,null,"","//","//"]
[0,null,null,null,null,null,"","//","//"]
[0,null,null,null,null,null,"","//","//"]
[0,null,null,null,null,null,"","//","//"]
[0,null,null,null,null,null,"","//","//"]
[0,null,null,null,null,null,"","//","//"]
[0,null,null,null,null,null,"","//","//"]
[0,null,null,null,null,null,"","//","//"]
[0,null,null,null,null,null,"","//","//"]
[0,null,null,null,null,null,"","//","//"]
[0,null,null,null,null,null,"","//","//"]
[0,null,null,null,null,null,"","//","//"]
[0,null,null,null,null,null,"","//","//"]
[0,null,null,null,null,null,"","//","//"]
[0,null,null,null,null,null,"","//","//"]
[0,null,null,null,null,null,"","//","//"]
[0,null,null,null,null,null,"","//","//"]
[0,null,null,null,null,null,"","//","//"]
[0,null,null,null,null,null,"","//","//"]
[0,null,null,null,null,null,"","//","//"]
[0,null,null,null,null,null,"","//","//"]
[0,null,null,null,null,null,"","//","//"]
[0,null,null,null,null,null,"","//","//"]
[0,null,null,null,null,null,"","//","//"]
[0,null,null,null,null,null,"","//","//"]
[0,null,null,null,null,null,"","//","//"]
[0,null,null,null,null,null,"","//","//"]
[0,null,null,null,null,null,"","//","//"]
[0,null,null,null,null,null,"","//","//"]
[0,null,null,null,null,null,"","//","//"]
[0,null,null,null,null,null,"","//","//"]
[0,null,null,null,null,null,"","//","//"]
[0,null,null,null,null,null,"","//","//"]
[0,null,null,null,null,null,"","//","//"]
[0,null,null,null,null,null,"","//","//"]
[0,null,null,null,null,null,"","//","//"]
[0,null,null,null,null,null,"","//","//"]
[0,null,null,null,null,null,"","//","//"]
[0,null,null,null,null,null,"","//","//"]
[0,null,null,null,null,null,"","//","//"]
[0,null,null,null,null,null,"","//","//"]
[0,null,null,null,null,null,"",{"$f":"IF(OR($G7872=\"NTSI\",$G7872=\"TTSI\"),$E7872,LEFT($E7872,4)&\"/\"&MID($E7872,5,2)&\"/\"&RIGHT($E7872,2))","v":"//"},{"$f":"IF(OR($G7872=\"NTSI\",$G7872=\"TTSI\"),$F7872,LEFT($F7872,4)&\"/\"&MID($F7872,5,2)&\"/\"&RIGHT($F7872,2))","v":"//"}]
[0,null,null,null,null,null,"","//","//"]
[0,null,null,null,null,null,"","//","//"]
[0,null,null,null,null,null,"","//","//"]
[0,null,null,null,null,null,"","//","//"]
[{"$f":"IF(RIGHT(B7877,1)=\"H\",LEFT(B7877,11)&\"B\",B7877)","v":0},null,null,null,null,null,{"$f":"MID(C7877,4,4)","v":""},"//","//"]
[0,null,null,null,null,null,"","//","//"]
[0,null,null,null,null,null,"","//","//"]
[0,null,null,null,null,null,"","//","//"]
[0,null,null,null,null,null,"","//","//"]
[0,null,null,null,null,null,"","//","//"]
[0,null,null,null,null,null,"","//","//"]
[0,null,null,null,null,null,"","//","//"]
[0,null,null,null,null,null,"","//","//"]
[0,null,null,null,null,null,"","//","//"]
[0,null,null,null,null,null,"","//","//"]
[0,null,null,null,null,null,"","//","//"]
[0,null,null,null,null,null,"","//","//"]
[0,null,null,null,null,null,"","//","//"]
[0,null,null,null,null,null,"","//","//"]
[0,null,null,null,null,null,"","//","//"]
[0,null,null,null,null,null,"","//","//"]
[0,null,null,null,null,null,"","//","//"]
[0,null,null,null,null,null,"","//","//"]
[0,null,null,null,null,null,"","//","//"]
[0,null,null,null,null,null,"","//","//"]
[0,null,null,null,null,null,"","//","//"]
[0,null,null,null,null,null,"","//","//"]
[0,null,null,null,null,null,"","//","//"]
[0,null,null,null,null,null,"","//","//"]
[0,null,null,null,null,null,"","//","//"]
[0,null,null,null,null,null,"","//","//"]
[0,null,null,null,null,null,"","//","//"]
[0,null,null,null,null,null,"","//","//"]
[0,null,null,null,null,null,"","//","//"]
[0,null,null,null,null,null,"","//","//"]
[0,null,null,null,null,null,"","//","//"]
[0,null,null,null,null,null,"","//","//"]
[0,null,null,null,null,null,"","//","//"]
[0,null,null,null,null,null,"","//","//"]
[0,null,null,null,null,null,"","//","//"]
[0,null,null,null,null,null,"","//","//"]
[0,null,null,null,null,null,"","//","//"]
[0,null,null,null,null,null,"","//","//"]
[0,null,null,null,null,null,"","//","//"]
[0,null,null,null,null,null,"","//","//"]
[0,null,null,null,null,null,"","//","//"]
[0,null,null,null,null,null,"","//","//"]
[0,null,null,null,null,null,"","//","//"]
[0,null,null,null,null,null,"","//","//"]
[0,null,null,null,null,null,"","//","//"]
[0,null,null,null,null,null,"","//","//"]
[0,null,null,null,null,null,"","//","//"]
[0,null,null,null,null,null,"","//","//"]
[0,null,null,null,null,null,"","//","//"]
[0,null,null,null,null,null,"","//","//"]
[0,null,null,null,null,null,"","//","//"]
[0,null,null,null,null,null,"","//","//"]
[0,null,null,null,null,null,"","//","//"]
[0,null,null,null,null,null,"","//","//"]
[0,null,null,null,null,null,"","//","//"]
[0,null,null,null,null,null,"","//","//"]
[0,null,null,null,null,null,"","//","//"]
[0,null,null,null,null,null,"","//","//"]
[0,null,null,null,null,null,"",{"$f":"IF(OR($G7936=\"NTSI\",$G7936=\"TTSI\"),$E7936,LEFT($E7936,4)&\"/\"&MID($E7936,5,2)&\"/\"&RIGHT($E7936,2))","v":"//"},{"$f":"IF(OR($G7936=\"NTSI\",$G7936=\"TTSI\"),$F7936,LEFT($F7936,4)&\"/\"&MID($F7936,5,2)&\"/\"&RIGHT($F7936,2))","v":"//"}]
[0,null,null,null,null,null,"","//","//"]
[0,null,null,null,null,null,"","//","//"]
[0,null,null,null,null,null,"","//","//"]
[0,null,null,null,null,null,"","//","//"]
[{"$f":"IF(RIGHT(B7941,1)=\"H\",LEFT(B7941,11)&\"B\",B7941)","v":0},null,null,null,null,null,{"$f":"MID(C7941,4,4)","v":""},"//","//"]
[0,null,null,null,null,null,"","//","//"]
[0,null,null,null,null,null,"","//","//"]
[0,null,null,null,null,null,"","//","//"]
[0,null,null,null,null,null,"","//","//"]
[0,null,null,null,null,null,"","//","//"]
[0,null,null,null,null,null,"","//","//"]
[0,null,null,null,null,null,"","//","//"]
[0,null,null,null,null,null,"","//","//"]
[0,null,null,null,null,null,"","//","//"]
[0,null,null,null,null,null,"","//","//"]
[0,null,null,null,null,null,"","//","//"]
[0,null,null,null,null,null,"","//","//"]
[0,null,null,null,null,null,"","//","//"]
[0,null,null,null,null,null,"","//","//"]
[0,null,null,null,null,null,"","//","//"]
[0,null,null,null,null,null,"","//","//"]
[0,null,null,null,null,null,"","//","//"]
[0,null,null,null,null,null,"","//","//"]
[0,null,null,null,null,null,"","//","//"]
[0,null,null,null,null,null,"","//","//"]
[0,null,null,null,null,null,"","//","//"]
[0,null,null,null,null,null,"","//","//"]
[0,null,null,null,null,null,"","//","//"]
[0,null,null,null,null,null,"","//","//"]
[0,null,null,null,null,null,"","//","//"]
[0,null,null,null,null,null,"","//","//"]
[0,null,null,null,null,null,"","//","//"]
[0,null,null,null,null,null,"","//","//"]
[0,null,null,null,null,null,"","//","//"]
[0,null,null,null,null,null,"","//","//"]
[0,null,null,null,null,null,"","//","//"]
[0,null,null,null,null,null,"","//","//"]
[0,null,null,null,null,null,"","//","//"]
[0,null,null,null,null,null,"","//","//"]
[0,null,null,null,null,null,"","//","//"]
[0,null,null,null,null,null,"","//","//"]
[0,null,null,null,null,null,"","//","//"]
[0,null,null,null,null,null,"","//","//"]
[0,null,null,null,null,null,"","//","//"]
[0,null,null,null,null,null,"","//","//"]
[0,null,null,null,null,null,"","//","//"]
[0,null,null,null,null,null,"","//","//"]
[0,null,null,null,null,null,"","//","//"]
[0,null,null,null,null,null,"","//","//"]
[0,null,null,null,null,null,"","//","//"]
[0,null,null,null,null,null,"","//","//"]
[0,null,null,null,null,null,"","//","//"]
[0,null,null,null,null,null,"","//","//"]
[0,null,null,null,null,null,"","//","//"]
[0,null,null,null,null,null,"","//","//"]
[0,null,null,null,null,null,"","//","//"]
[0,null,null,null,null,null,"","//","//"]
[0,null,null,null,null,null,"","//","//"]
[0,null,null,null,null,null,"","//","//"]
[0,null,null,null,null,null,"","//","//"]
[0,null,null,null,null,null,"","//","//"]
[0,null,null,null,null,null,"","//","//"]
[0,null,null,null,null,null,"","//","//"]
[0,null,null,null,null,null,"",{"$f":"IF(OR($G8000=\"NTSI\",$G8000=\"TTSI\"),$E8000,LEFT($E8000,4)&\"/\"&MID($E8000,5,2)&\"/\"&RIGHT($E8000,2))","v":"//"},{"$f":"IF(OR($G8000=\"NTSI\",$G8000=\"TTSI\"),$F8000,LEFT($F8000,4)&\"/\"&MID($F8000,5,2)&\"/\"&RIGHT($F8000,2))","v":"//"}]
[0,null,null,null,null,null,"","//","//"]
[0,null,null,null,null,null,"","//","//"]
[0,null,null,null,null,null,"","//","//"]
[0,null,null,null,null,null,"","//","//"]
[{"$f":"IF(RIGHT(B8005,1)=\"H\",LEFT(B8005,11)&\"B\",B8005)","v":0},null,null,null,null,null,{"$f":"MID(C8005,4,4)","v":""},"//","//"]
[0,null,null,null,null,null,"","//","//"]
[0,null,null,null,null,null,"","//","//"]
[0,null,null,null,null,null,"","//","//"]
[0,null,null,null,null,null,"","//","//"]
[0,null,null,null,null,null,"","//","//"]
[0,null,null,null,null,null,"","//","//"]
[0,null,null,null,null,null,"","//","//"]
[0,null,null,null,null,null,"","//","//"]
[0,null,null,null,null,null,"","//","//"]
[0,null,null,null,null,null,"","//","//"]
[0,null,null,null,null,null,"","//","//"]
[0,null,null,null,null,null,"","//","//"]
[0,null,null,null,null,null,"","//","//"]
[0,null,null,null,null,null,"","//","//"]
[0,null,null,null,null,null,"","//","//"]
[0,null,null,null,null,null,"","//","//"]
[0,null,null,null,null,null,"","//","//"]
[0,null,null,null,null,null,"","//","//"]
[0,null,null,null,null,null,"","//","//"]
[0,null,null,null,null,null,"","//","//"]
[0,null,null,null,null,null,"","//","//"]
[0,null,null,null,null,null,"","//","//"]
[0,null,null,null,null,null,"","//","//"]
[0,null,null,null,null,null,"","//","//"]
[0,null,null,null,null,null,"","//","//"]
[0,null,null,null,null,null,"","//","//"]
[0,null,null,null,null,null,"","//","//"]
[0,null,null,null,null,null,"","//","//"]
[0,null,null,null,null,null,"","//","//"]
[0,null,null,null,null,null,"","//","//"]
[0,null,null,null,null,null,"","//","//"]
[0,null,null,null,null,null,"","//","//"]
[0,null,null,null,null,null,"","//","//"]
[0,null,null,null,null,null,"","//","//"]
[0,null,null,null,null,null,"","//","//"]
[0,null,null,null,null,null,"","//","//"]
[0,null,null,null,null,null,"","//","//"]
[0,null,null,null,null,null,"","//","//"]
[0,null,null,null,null,null,"","//","//"]
[0,null,null,null,null,null,"","//","//"]
[0,null,null,null,null,null,"","//","//"]
[0,null,null,null,null,null,"","//","//"]
[0,null,null,null,null,null,"","//","//"]
[0,null,null,null,null,null,"","//","//"]
[0,null,null,null,null,null,"","//","//"]
[0,null,null,null,null,null,"","//","//"]
[0,null,null,null,null,null,"","//","//"]
[0,null,null,null,null,null,"","//","//"]
[0,null,null,null,null,null,"","//","//"]
[0,null,null,null,null,null,"","//","//"]
[0,null,null,null,null,null,"","//","//"]
[0,null,null,null,null,null,"","//","//"]
[0,null,null,null,null,null,"","//","//"]
[0,null,null,null,null,null,"","//","//"]
[0,null,null,null,null,null,"","//","//"]
[0,null,null,null,null,null,"","//","//"]
[0,null,null,null,null,null,"","//","//"]
[0,null,null,null,null,null,"","//","//"]
[0,null,null,null,null,null,"",{"$f":"IF(OR($G8064=\"NTSI\",$G8064=\"TTSI\"),$E8064,LEFT($E8064,4)&\"/\"&MID($E8064,5,2)&\"/\"&RIGHT($E8064,2))","v":"//"},{"$f":"IF(OR($G8064=\"NTSI\",$G8064=\"TTSI\"),$F8064,LEFT($F8064,4)&\"/\"&MID($F8064,5,2)&\"/\"&RIGHT($F8064,2))","v":"//"}]
[0,null,null,null,null,null,"","//","//"]
[0,null,null,null,null,null,"","//","//"]
[0,null,null,null,null,null,"","//","//"]
[0,null,null,null,null,null,"","//","//"]
[{"$f":"IF(RIGHT(B8069,1)=\"H\",LEFT(B8069,11)&\"B\",B8069)","v":0},null,null,null,null,null,{"$f":"MID(C8069,4,4)","v":""},"//","//"]
[0,null,null,null,null,null,"","//","//"]
[0,null,null,null,null,null,"","//","//"]
[0,null,null,null,null,null,"","//","//"]
[0,null,null,null,null,null,"","//","//"]
[0,null,null,null,null,null,"","//","//"]
[0,null,null,null,null,null,"","//","//"]
[0,null,null,null,null,null,"","//","//"]
[0,null,null,null,null,null,"","//","//"]
[0,null,null,null,null,null,"","//","//"]
[0,null,null,null,null,null,"","//","//"]
[0,null,null,null,null,null,"","//","//"]
[0,null,null,null,null,null,"","//","//"]
[0,null,null,null,null,null,"","//","//"]
[0,null,null,null,null,null,"","//","//"]
[0,null,null,null,null,null,"","//","//"]
[0,null,null,null,null,null,"","//","//"]
[0,null,null,null,null,null,"","//","//"]
[0,null,null,null,null,null,"","//","//"]
[0,null,null,null,null,null,"","//","//"]
[0,null,null,null,null,null,"","//","//"]
[0,null,null,null,null,null,"","//","//"]
[0,null,null,null,null,null,"","//","//"]
[0,null,null,null,null,null,"","//","//"]
[0,null,null,null,null,null,"","//","//"]
[0,null,null,null,null,null,"","//","//"]
[0,null,null,null,null,null,"","//","//"]
[0,null,null,null,null,null,"","//","//"]
[0,null,null,null,null,null,"","//","//"]
[0,null,null,null,null,null,"","//","//"]
[0,null,null,null,null,null,"","//","//"]
[0,null,null,null,null,null,"","//","//"]
[0,null,null,null,null,null,"","//","//"]
[0,null,null,null,null,null,"","//","//"]
[0,null,null,null,null,null,"","//","//"]
[0,null,null,null,null,null,"","//","//"]
[0,null,null,null,null,null,"","//","//"]
[0,null,null,null,null,null,"","//","//"]
[0,null,null,null,null,null,"","//","//"]
[0,null,null,null,null,null,"","//","//"]
[0,null,null,null,null,null,"","//","//"]
[0,null,null,null,null,null,"","//","//"]
[0,null,null,null,null,null,"","//","//"]
[0,null,null,null,null,null,"","//","//"]
[0,null,null,null,null,null,"","//","//"]
[0,null,null,null,null,null,"","//","//"]
[0,null,null,null,null,null,"","//","//"]
[0,null,null,null,null,null,"","//","//"]
[0,null,null,null,null,null,"","//","//"]
[0,null,null,null,null,null,"","//","//"]
[0,null,null,null,null,null,"","//","//"]
[0,null,null,null,null,null,"","//","//"]
[0,null,null,null,null,null,"","//","//"]
[0,null,null,null,null,null,"","//","//"]
[0,null,null,null,null,null,"","//","//"]
[0,null,null,null,null,null,"","//","//"]
[0,null,null,null,null,null,"","//","//"]
[0,null,null,null,null,null,"","//","//"]
[0,null,null,null,null,null,"","//","//"]
[0,null,null,null,null,null,"",{"$f":"IF(OR($G8128=\"NTSI\",$G8128=\"TTSI\"),$E8128,LEFT($E8128,4)&\"/\"&MID($E8128,5,2)&\"/\"&RIGHT($E8128,2))","v":"//"},{"$f":"IF(OR($G8128=\"NTSI\",$G8128=\"TTSI\"),$F8128,LEFT($F8128,4)&\"/\"&MID($F8128,5,2)&\"/\"&RIGHT($F8128,2))","v":"//"}]
[0,null,null,null,null,null,"","//","//"]
[0,null,null,null,null,null,"","//","//"]
[0,null,null,null,null,null,"","//","//"]
[0,null,null,null,null,null,"","//","//"]
[{"$f":"IF(RIGHT(B8133,1)=\"H\",LEFT(B8133,11)&\"B\",B8133)","v":0},null,null,null,null,null,{"$f":"MID(C8133,4,4)","v":""},"//","//"]
[0,null,null,null,null,null,"","//","//"]
[0,null,null,null,null,null,"","//","//"]
[0,null,null,null,null,null,"","//","//"]
[0,null,null,null,null,null,"","//","//"]
[0,null,null,null,null,null,"","//","//"]
[0,null,null,null,null,null,"","//","//"]
[0,null,null,null,null,null,"","//","//"]
[0,null,null,null,null,null,"","//","//"]
[0,null,null,null,null,null,"","//","//"]
[0,null,null,null,null,null,"","//","//"]
[0,null,null,null,null,null,"","//","//"]
[0,null,null,null,null,null,"","//","//"]
[0,null,null,null,null,null,"","//","//"]
[0,null,null,null,null,null,"","//","//"]
[0,null,null,null,null,null,"","//","//"]
[0,null,null,null,null,null,"","//","//"]
[0,null,null,null,null,null,"","//","//"]
[0,null,null,null,null,null,"","//","//"]
[0,null,null,null,null,null,"","//","//"]
[0,null,null,null,null,null,"","//","//"]
[0,null,null,null,null,null,"","//","//"]
[0,null,null,null,null,null,"","//","//"]
[0,null,null,null,null,null,"","//","//"]
[0,null,null,null,null,null,"","//","//"]
[0,null,null,null,null,null,"","//","//"]
[0,null,null,null,null,null,"","//","//"]
[0,null,null,null,null,null,"","//","//"]
[0,null,null,null,null,null,"","//","//"]
[0,null,null,null,null,null,"","//","//"]
[0,null,null,null,null,null,"","//","//"]
[0,null,null,null,null,null,"","//","//"]
[0,null,null,null,null,null,"","//","//"]
[0,null,null,null,null,null,"","//","//"]
[0,null,null,null,null,null,"","//","//"]
[0,null,null,null,null,null,"","//","//"]
[0,null,null,null,null,null,"","//","//"]
[0,null,null,null,null,null,"","//","//"]
[0,null,null,null,null,null,"","//","//"]
[0,null,null,null,null,null,"","//","//"]
[0,null,null,null,null,null,"","//","//"]
[0,null,null,null,null,null,"","//","//"]
[0,null,null,null,null,null,"","//","//"]
[0,null,null,null,null,null,"","//","//"]
[0,null,null,null,null,null,"","//","//"]
[0,null,null,null,null,null,"","//","//"]
[0,null,null,null,null,null,"","//","//"]
[0,null,null,null,null,null,"","//","//"]
[0,null,null,null,null,null,"","//","//"]
[0,null,null,null,null,null,"","//","//"]
[0,null,null,null,null,null,"","//","//"]
[0,null,null,null,null,null,"","//","//"]
[0,null,null,null,null,null,"","//","//"]
[0,null,null,null,null,null,"","//","//"]
[0,null,null,null,null,null,"","//","//"]
[0,null,null,null,null,null,"","//","//"]
[0,null,null,null,null,null,"","//","//"]
[0,null,null,null,null,null,"","//","//"]
[0,null,null,null,null,null,"","//","//"]
[0,null,null,null,null,null,"",{"$f":"IF(OR($G8192=\"NTSI\",$G8192=\"TTSI\"),$E8192,LEFT($E8192,4)&\"/\"&MID($E8192,5,2)&\"/\"&RIGHT($E8192,2))","v":"//"},{"$f":"IF(OR($G8192=\"NTSI\",$G8192=\"TTSI\"),$F8192,LEFT($F8192,4)&\"/\"&MID($F8192,5,2)&\"/\"&RIGHT($F8192,2))","v":"//"}]
[0,null,null,null,null,null,"","//","//"]
[0,null,null,null,null,null,"","//","//"]
[0,null,null,null,null,null,"","//","//"]
[0,null,null,null,null,null,"","//","//"]
[{"$f":"IF(RIGHT(B8197,1)=\"H\",LEFT(B8197,11)&\"B\",B8197)","v":0},null,null,null,null,null,{"$f":"MID(C8197,4,4)","v":""},"//","//"]
[0,null,null,null,null,null,"","//","//"]
[0,null,null,null,null,null,"","//","//"]
[0,null,null,null,null,null,"","//","//"]
[0,null,null,null,null,null,"","//","//"]
[0,null,null,null,null,null,"","//","//"]
[0,null,null,null,null,null,"","//","//"]
[0,null,null,null,null,null,"","//","//"]
[0,null,null,null,null,null,"","//","//"]
[0,null,null,null,null,null,"","//","//"]
[0,null,null,null,null,null,"","//","//"]
[0,null,null,null,null,null,"","//","//"]
[0,null,null,null,null,null,"","//","//"]
[0,null,null,null,null,null,"","//","//"]
[0,null,null,null,null,null,"","//","//"]
[0,null,null,null,null,null,"","//","//"]
[0,null,null,null,null,null,"","//","//"]
[0,null,null,null,null,null,"","//","//"]
[0,null,null,null,null,null,"","//","//"]
[0,null,null,null,null,null,"","//","//"]
[0,null,null,null,null,null,"","//","//"]
[0,null,null,null,null,null,"","//","//"]
[0,null,null,null,null,null,"","//","//"]
[0,null,null,null,null,null,"","//","//"]
[0,null,null,null,null,null,"","//","//"]
[0,null,null,null,null,null,"","//","//"]
[0,null,null,null,null,null,"","//","//"]
[0,null,null,null,null,null,"","//","//"]
[0,null,null,null,null,null,"","//","//"]
[0,null,null,null,null,null,"","//","//"]
[0,null,null,null,null,null,"","//","//"]
[0,null,null,null,null,null,"","//","//"]
[0,null,null,null,null,null,"","//","//"]
[0,null,null,null,null,null,"","//","//"]
[0,null,null,null,null,null,"","//","//"]
[0,null,null,null,null,null,"","//","//"]
[0,null,null,null,null,null,"","//","//"]
[0,null,null,null,null,null,"","//","//"]
[0,null,null,null,null,null,"","//","//"]
[0,null,null,null,null,null,"","//","//"]
[0,null,null,null,null,null,"","//","//"]
[0,null,null,null,null,null,"","//","//"]
[0,null,null,null,null,null,"","//","//"]
[0,null,null,null,null,null,"","//","//"]
[0,null,null,null,null,null,"","//","//"]
[0,null,null,null,null,null,"","//","//"]
[0,null,null,null,null,null,"","//","//"]
[0,null,null,null,null,null,"","//","//"]
[0,null,null,null,null,null,"","//","//"]
[0,null,null,null,null,null,"","//","//"]
[0,null,null,null,null,null,"","//","//"]
[0,null,null,null,null,null,"","//","//"]
[0,null,null,null,null,null,"","//","//"]
[0,null,null,null,null,null,"","//","//"]
[0,null,null,null,null,null,"","//","//"]
[0,null,null,null,null,null,"","//","//"]
[0,null,null,null,null,null,"","//","//"]
[0,null,null,null,null,null,"","//","//"]
[0,null,null,null,null,null,"","//","//"]